program: Orca
programVersion: 5.0.2
elementType: S O O O O O O N N N N N C C C C C C C C C C C C C C C H H H H H H H H H H H H H H H H H
charge: 0
multiplicity: 1
keywords: wb97x-d3
keywords: def2-TZVPP
keywords: def2/J RIJCOSX
keywords: DEFGRID2
keywords: scfconv7
keywords: smallprint printgap noloewdin
keywords: NOSOSCF
formula: C15H17N5O6S
InChI: InChI=1S/C15H17N5O6S/c1-9-16-13(18-14(17-9)26-4)20(2)15(22)19-27(23,24)11-8-6-5-7-10(11)12(21)25-3/h5-8,19H,1-4H3
44 atoms
S  1.873656 -0.52869 -1.740167
O  2.112909 -1.737622 -2.503485
O  1.957625 0.744343 -2.42926
O  1.558833 2.069786 0.075158
O  0.651942 -2.488761 0.012922
O  0.75125 1.078544 1.911299
O  -5.203699 0.725263 1.404879
N  0.344359 -0.545577 -1.082842
N  -1.373231 -1.474315 0.234651
N  -1.948476 0.550577 -0.795127
N  -3.30021 -0.396813 0.863391
N  -3.923091 1.636438 -0.160699
C  2.931034 -0.573667 -0.308684
C  2.670819 0.173829 0.842404
C  4.002761 -1.451056 -0.35917
C  3.494653 0.00189 1.946616
C  -0.078075 -1.562648 -0.268463
C  4.841518 -1.575357 0.738287
C  4.583228 -0.856082 1.89179
C  1.541042 1.138609 1.000827
C  -2.225419 -0.396999 0.093135
C  -1.812313 -2.558751 1.115658
C  -2.819118 1.553195 -0.881854
C  -4.10682 0.634359 0.690426
C  -2.527154 2.643587 -1.847581
C  0.553542 3.088384 0.116369
C  -5.496461 -0.288315 2.368294
H  -0.326608 0.209679 -1.317469
H  4.189494 -2.051459 -1.237853
H  3.295091 0.557735 2.853124
H  5.681675 -2.254069 0.69108
H  5.221906 -0.965621 2.757304
H  -1.162881 -3.41332 0.98412
H  -1.78597 -2.254771 2.1593
H  -2.822659 -2.856319 0.856285
H  -2.390373 3.585033 -1.314105
H  -1.630926 2.435038 -2.425269
H  -3.367521 2.780453 -2.52787
H  0.593224 3.58468 -0.846633
H  -0.437003 2.673141 0.276685
H  0.775806 3.805231 0.90415
H  -6.439165 0.005201 2.820605
H  -4.727666 -0.339605 3.137847
H  -5.60977 -1.264253 1.898887
elementType: S O N C H
totalener: -1705.33676449 hartree
nucrepener: 2923.52717396 hartree
electener: -4628.86393845 hartree
oneelecener: -8149.85038718 hartree
twoeener: 3520.98644873 hartree
cpcmener: -0.05593841 hartree
kineticenergy: 1699.18858993 hartree
xcener: -140.064667677749 hartree
chargesum: -0.0000000
charge: 0.887825 -0.511491 -0.518083 -0.253246 -0.483015 -0.459528 -0.281277 -0.233610 -0.092483 -0.408156 -0.424652 -0.384029 -0.173476 0.110304 -0.031093 -0.206711 0.399483 -0.168204 -0.102568 0.491206 0.408692 -0.158206 0.336033 0.447487 -0.269075 -0.122255 -0.116098 0.228122 0.151481 0.149463 0.167412 0.167765 0.120589 0.123403 0.116169 0.114398 0.104337 0.125806 0.131238 0.102706 0.142612 0.133624 0.118905 0.118197
qa: 0.8878 -0.5115 -0.5181 -0.2532 -0.4830 -0.4595 -0.2813 -0.2336 -0.0925 -0.4082 -0.4247 -0.3840 -0.1735 0.1103 -0.0311 -0.2067 0.3995 -0.1682 -0.1026 0.4912 0.4087 -0.1582 0.3360 0.4475 -0.2691 -0.1223 -0.1161 0.2281 0.1515 0.1495 0.1674 0.1678 0.1206 0.1234 0.1162 0.1144 0.1043 0.1258 0.1312 0.1027 0.1426 0.1336 0.1189 0.1182
va: 5.7901 1.9851 1.9536 2.1539 2.0272 2.0284 2.1247 3.0688 3.2576 2.9981 2.9423 3.0021 3.8256 3.5455 3.8852 4.0311 4.3044 3.9609 3.8950 4.0416 4.1127 3.8511 3.8799 4.2703 3.9527 3.8486 3.8461 1.0559 1.0147 1.0093 0.9875 0.9860 1.0173 0.9963 1.0000 0.9984 1.0084 1.0079 0.9927 0.9932 0.9920 0.9944 0.9943 0.9933
dispcorr: -0.026577274 hartree
energy: -1705.363341763408
dipole: -10.43605 9.37843 -1.05762 4.39947 -3.59245 0.80701 9.01125 -6.88374 2.12751
magnitude: 2.50920 au
magnitude: 6.37789 debye
