program: Orca
programVersion: 5.0.2
elementType: S O O O O O O N N N N N C C C C C C C C C C C C C C C H H H H H H H H H H H H H H H H H
charge: 0
multiplicity: 1
keywords: wb97x-d3
keywords: def2-TZVPP
keywords: def2/J RIJCOSX
keywords: DEFGRID2
keywords: scfconv7
keywords: smallprint printgap noloewdin
keywords: NOSOSCF
formula: C15H17N5O6S
InChI: InChI=1S/C15H17N5O6S/c1-9-16-13(18-14(17-9)26-4)20(2)15(22)19-27(23,24)11-8-6-5-7-10(11)12(21)25-3/h5-8,19H,1-4H3
44 atoms
S  1.877412 -0.546808 -1.74293
O  2.12836 -1.75826 -2.496637
O  1.963733 0.721616 -2.43894
O  1.528329 2.07213 0.06191
O  0.651899 -2.488779 0.029006
O  0.705569 1.064258 1.881561
O  -5.132421 0.795601 1.479283
N  0.342314 -0.56265 -1.097794
N  -1.384195 -1.495354 0.208515
N  -1.973287 0.509022 -0.845512
N  -3.267426 -0.368981 0.895171
N  -3.905149 1.642048 -0.163466
C  2.921469 -0.576692 -0.300605
C  2.649496 0.183171 0.839129
C  3.998157 -1.449026 -0.333791
C  3.469372 0.032323 1.949593
C  -0.082855 -1.574222 -0.278377
C  4.831212 -1.554164 0.769784
C  4.563514 -0.819336 1.911574
C  1.507541 1.135184 0.982786
C  -2.227718 -0.409172 0.079618
C  -1.801643 -2.580655 1.099293
C  -2.830247 1.52403 -0.922665
C  -4.067777 0.667587 0.723203
C  -2.559387 2.584118 -1.927802
C  0.511281 3.078343 0.101865
C  -5.38797 -0.174435 2.496209
H  -0.33516 0.174679 -1.364053
H  4.191192 -2.05934 -1.204397
H  3.260729 0.598661 2.847587
H  5.674942 -2.229359 0.737582
H  5.19863 -0.912219 2.781727
H  -2.86751 -2.745801 0.99241
H  -1.289664 -3.493265 0.819342
H  -1.578141 -2.351339 2.140023
H  -1.648389 2.381193 -2.484262
H  -3.392786 2.658915 -2.627044
H  -2.465836 3.552441 -1.435496
H  0.597126 3.624715 -0.831463
H  -0.481626 2.643722 0.184052
H  0.679043 3.756498 0.937147
H  -4.579986 -0.208363 3.225545
H  -5.540188 -1.166336 2.073349
H  -6.30108 0.151584 2.985603
elementType: S O N C H
totalener: -1705.33706449 hartree
nucrepener: 2925.83378961 hartree
electener: -4631.17085410 hartree
oneelecener: -8154.48369799 hartree
twoeener: 3523.31284389 hartree
cpcmener: -0.05601851 hartree
kineticenergy: 1699.18169828 hartree
xcener: -140.062567736071 hartree
chargesum: 0.0000000
charge: 0.887927 -0.510397 -0.517669 -0.253122 -0.484539 -0.458686 -0.281165 -0.232966 -0.096424 -0.412094 -0.422583 -0.383888 -0.172548 0.110389 -0.032769 -0.205866 0.405917 -0.166833 -0.104134 0.491777 0.404810 -0.166523 0.337581 0.448003 -0.266119 -0.126109 -0.115935 0.228289 0.151672 0.149488 0.167517 0.167634 0.116516 0.119946 0.130291 0.103691 0.126426 0.113696 0.132464 0.103297 0.142312 0.118712 0.118388 0.133625
qa: 0.8879 -0.5104 -0.5177 -0.2531 -0.4845 -0.4587 -0.2812 -0.2330 -0.0964 -0.4121 -0.4226 -0.3839 -0.1725 0.1104 -0.0328 -0.2059 0.4059 -0.1668 -0.1041 0.4918 0.4048 -0.1665 0.3376 0.4480 -0.2661 -0.1261 -0.1159 0.2283 0.1517 0.1495 0.1675 0.1676 0.1165 0.1199 0.1303 0.1037 0.1264 0.1137 0.1325 0.1033 0.1423 0.1187 0.1184 0.1336
va: 5.7905 1.9866 1.9547 2.1540 2.0234 2.0295 2.1252 3.0723 3.2589 2.9956 2.9400 3.0035 3.8255 3.5526 3.8870 4.0299 4.3018 3.9601 3.8959 4.0356 4.1135 3.8597 3.8799 4.2676 3.9519 3.8500 3.8459 1.0537 1.0146 1.0091 0.9874 0.9861 1.0017 1.0094 0.9948 1.0088 1.0064 0.9999 0.9933 0.9902 0.9925 0.9949 0.9928 0.9942
dispcorr: -0.026633009 hartree
energy: -1705.363697502597
dipole: -10.37219 9.30288 -1.06931 4.51850 -3.68774 0.83076 9.09295 -6.97191 2.12104
magnitude: 2.51642 au
magnitude: 6.39624 debye
