program: Orca
programVersion: 5.0.2
elementType: S O O O O O O N N N N N C C C C C C C C C C C C C C C H H H H H H H H H H H H H H H H H
charge: 0
multiplicity: 1
keywords: wb97x-d3
keywords: def2-TZVPP
keywords: def2/J RIJCOSX
keywords: DEFGRID2
keywords: scfconv7
keywords: smallprint printgap noloewdin
keywords: NOSOSCF
formula: C15H17N5O6S
InChI: InChI=1S/C15H17N5O6S/c1-9-16-13(18-14(17-9)26-4)20(2)15(22)19-27(23,24)11-8-6-5-7-10(11)12(21)25-3/h5-8,19H,1-4H3
44 atoms
S  1.756581 -0.616008 -1.704872
O  2.192842 -1.72051 -2.53351
O  1.799693 0.733881 -2.242134
O  2.441416 2.742678 0.356887
O  0.485893 -2.78519 -0.204208
O  0.556644 1.55044 0.534085
O  -5.083592 0.615353 1.662749
N  0.164309 -0.829381 -1.283959
N  -1.534669 -1.775143 0.035493
N  -2.083981 0.311845 -0.856904
N  -3.318925 -0.604035 0.904719
N  -3.87721 1.520346 0.035651
C  2.674669 -0.648362 -0.18814
C  2.664916 0.450107 0.673047
C  3.488548 -1.742838 0.05685
C  3.487415 0.425969 1.790922
C  -0.241429 -1.852272 -0.475832
C  4.291732 -1.757174 1.18701
C  4.288964 -0.676477 2.051932
C  1.759669 1.626555 0.495283
C  -2.332696 -0.646655 0.02204
C  -1.956201 -2.913846 0.852531
C  -2.859242 1.393403 -0.792975
C  -4.062802 0.483873 0.849524
C  -2.543212 2.494423 -1.737503
C  1.693931 3.961721 0.251615
C  -5.349867 -0.410741 2.620921
H  -0.496946 -0.044068 -1.430352
H  3.512151 -2.580129 -0.625124
H  3.495338 1.267128 2.471083
H  4.922664 -2.612893 1.381871
H  4.917655 -0.682103 2.931762
H  -1.603602 -2.824293 1.879549
H  -3.037787 -2.974604 0.853499
H  -1.570159 -3.830589 0.420446
H  -3.105109 3.394245 -1.504794
H  -1.475497 2.71458 -1.713919
H  -2.785655 2.186412 -2.756511
H  2.430592 4.749567 0.128882
H  1.032575 3.943774 -0.613985
H  1.11345 4.144362 1.155033
H  -6.226509 -0.076532 3.167954
H  -4.517724 -0.533464 3.312492
H  -5.567468 -1.362337 2.138398
elementType: S O N C H
totalener: -1705.33853269 hartree
nucrepener: 2886.31257647 hartree
electener: -4591.65110916 hartree
oneelecener: -8076.55618800 hartree
twoeener: 3484.90507884 hartree
cpcmener: -0.05172866 hartree
kineticenergy: 1699.18409502 hartree
xcener: -140.061285915950 hartree
chargesum: -0.0000000
charge: 0.896493 -0.511071 -0.528312 -0.270303 -0.494199 -0.455256 -0.279917 -0.209114 -0.104567 -0.409696 -0.422618 -0.371756 -0.127732 0.074796 -0.020473 -0.194583 0.408815 -0.161870 -0.106104 0.473551 0.392892 -0.171353 0.324146 0.460787 -0.232383 -0.129019 -0.115144 0.216392 0.151263 0.152991 0.167815 0.167498 0.132273 0.116675 0.116813 0.099665 0.096233 0.116500 0.134406 0.121456 0.123267 0.133821 0.118824 0.118100
qa: 0.8965 -0.5111 -0.5283 -0.2703 -0.4942 -0.4553 -0.2799 -0.2091 -0.1046 -0.4097 -0.4226 -0.3718 -0.1277 0.0748 -0.0205 -0.1946 0.4088 -0.1619 -0.1061 0.4736 0.3929 -0.1714 0.3241 0.4608 -0.2324 -0.1290 -0.1151 0.2164 0.1513 0.1530 0.1678 0.1675 0.1323 0.1167 0.1168 0.0997 0.0962 0.1165 0.1344 0.1215 0.1233 0.1338 0.1188 0.1181
va: 5.7951 1.9852 1.9568 2.1438 2.0167 2.0360 2.1261 3.0797 3.2416 3.0066 2.9399 3.0144 3.7749 3.6994 3.8406 4.0241 4.3073 3.9511 3.8947 4.0474 4.1411 3.8667 3.9380 4.2414 3.9359 3.8613 3.8448 1.0761 1.0191 1.0056 0.9869 0.9859 0.9936 1.0029 1.0059 1.0182 1.0075 1.0011 0.9941 0.9879 0.9920 0.9942 0.9951 0.9927
dispcorr: -0.024513431 hartree
energy: -1705.363046116946
dipole: -8.33983 7.63630 -0.70353 5.15892 -4.35089 0.80803 10.77621 -7.69662 3.07959
magnitude: 3.26063 au
magnitude: 8.28787 debye
