program: Orca
programVersion: 5.0.2
elementType: S O O O O O O N N N N N C C C C C C C C C C C C C C C H H H H H H H H H H H H H H H H H
charge: 0
multiplicity: 1
keywords: wb97x-d3
keywords: def2-TZVPP
keywords: def2/J RIJCOSX
keywords: DEFGRID2
keywords: scfconv7
keywords: smallprint printgap noloewdin
keywords: NOSOSCF
formula: C15H17N5O6S
InChI: InChI=1S/C15H17N5O6S/c1-9-16-13(18-14(17-9)26-4)20(2)15(22)19-27(23,24)11-8-6-5-7-10(11)12(21)25-3/h5-8,19H,1-4H3
44 atoms
S  1.729105 -0.687652 -1.703956
O  2.149654 -1.823673 -2.497476
O  1.769774 0.64388 -2.286244
O  2.433121 2.750676 0.203786
O  0.469531 -2.803165 -0.122329
O  0.567802 1.548601 0.484529
O  -5.068655 0.67284 1.709147
N  0.141553 -0.88004 -1.257309
N  -1.538609 -1.770294 0.123153
N  -2.083099 0.297758 -0.817166
N  -3.312059 -0.569942 0.972436
N  -3.864701 1.536699 0.057208
C  2.669471 -0.666114 -0.20031
C  2.684923 0.471878 0.608252
C  3.478517 -1.755048 0.080782
C  3.53271 0.496501 1.706571
C  -0.255202 -1.872406 -0.407482
C  4.303877 -1.722089 1.194764
C  4.331677 -0.598901 2.003014
C  1.768201 1.634682 0.405998
C  -2.330874 -0.638393 0.085682
C  -1.956594 -2.881463 0.97925
C  -2.852317 1.385065 -0.773946
C  -4.051013 0.519816 0.895824
C  -2.5296 2.465667 -1.739717
C  1.668225 3.957691 0.084107
C  -5.334357 -0.332378 2.689297
H  -0.514721 -0.090639 -1.408111
H  3.481799 -2.623589 -0.561235
H  3.561984 1.369447 2.344775
H  4.929961 -2.573855 1.419913
H  4.979524 -0.566932 2.868268
H  -3.037688 -2.945968 0.983111
H  -1.566636 -3.810748 0.579834
H  -1.603568 -2.755158 2.001453
H  -2.695261 2.115651 -2.758813
H  -3.136998 3.349318 -1.570329
H  -1.475538 2.731783 -1.66186
H  2.391592 4.751509 -0.073398
H  0.990058 3.910009 -0.767349
H  1.103448 4.155359 0.994247
H  -6.208498 0.01508 3.232068
H  -4.499982 -0.442322 3.380455
H  -5.554909 -1.293671 2.227582
elementType: S O N C H
totalener: -1705.33854735 hartree
nucrepener: 2887.60794955 hartree
electener: -4592.94649689 hartree
oneelecener: -8079.12966979 hartree
twoeener: 3486.18317290 hartree
cpcmener: -0.05172200 hartree
kineticenergy: 1699.19319233 hartree
xcener: -140.063166597276 hartree
chargesum: 0.0000000
charge: 0.897121 -0.510910 -0.528445 -0.270575 -0.494003 -0.455212 -0.279869 -0.210698 -0.104100 -0.409404 -0.423247 -0.371059 -0.128003 0.074659 -0.018580 -0.194899 0.408463 -0.162454 -0.105944 0.473107 0.393254 -0.171237 0.322550 0.461431 -0.229744 -0.130114 -0.114851 0.216334 0.150324 0.153294 0.167709 0.167583 0.116673 0.117115 0.132370 0.115288 0.099444 0.095682 0.135124 0.122328 0.122926 0.133818 0.118715 0.118034
qa: 0.8971 -0.5109 -0.5284 -0.2706 -0.4940 -0.4552 -0.2799 -0.2107 -0.1041 -0.4094 -0.4232 -0.3711 -0.1280 0.0747 -0.0186 -0.1949 0.4085 -0.1625 -0.1059 0.4731 0.3933 -0.1712 0.3225 0.4614 -0.2297 -0.1301 -0.1149 0.2163 0.1503 0.1533 0.1677 0.1676 0.1167 0.1171 0.1324 0.1153 0.0994 0.0957 0.1351 0.1223 0.1229 0.1338 0.1187 0.1180
va: 5.7947 1.9854 1.9567 2.1441 2.0168 2.0369 2.1262 3.0796 3.2418 3.0081 2.9397 3.0147 3.7726 3.6991 3.8426 4.0254 4.3080 3.9511 3.8945 4.0498 4.1411 3.8656 3.9407 4.2400 3.9326 3.8616 3.8446 1.0772 1.0197 1.0055 0.9870 0.9858 1.0027 1.0065 0.9936 1.0021 1.0191 1.0071 0.9942 0.9864 0.9922 0.9941 0.9951 0.9928
dispcorr: -0.024590437 hartree
energy: -1705.363137782796
dipole: -8.21863 7.55820 -0.66043 5.59162 -4.65346 0.93816 10.74317 -7.68063 3.06254
magnitude: 3.27039 au
magnitude: 8.31268 debye
