program: Orca
programVersion: 5.0.2
elementType: S O O O O O O N N N N N C C C C C C C C C C C C C C C H H H H H H H H H H H H H H H H H
charge: 0
multiplicity: 1
keywords: wb97x-d3
keywords: def2-TZVPP
keywords: def2/J RIJCOSX
keywords: DEFGRID2
keywords: scfconv7
keywords: smallprint printgap noloewdin
keywords: NOSOSCF
formula: C15H17N5O6S
InChI: InChI=1S/C15H17N5O6S/c1-9-16-13(18-14(17-9)26-4)20(2)15(22)19-27(23,24)11-8-6-5-7-10(11)12(21)25-3/h5-8,19H,1-4H3
44 atoms
S  1.568528 -0.214713 -1.465564
O  1.875688 -1.112989 -2.558501
O  1.559422 1.220076 -1.700106
O  2.666967 2.681603 0.881853
O  0.436493 -2.712638 -0.485612
O  0.794639 1.539193 1.326183
O  -3.122139 2.373578 -0.653825
N  0.042126 -0.531614 -0.888746
N  -1.615555 -1.92334 0.059253
N  -3.794437 -1.326528 0.544866
N  -2.320415 0.271971 -0.310425
N  -4.537657 0.875794 0.180116
C  2.670316 -0.559656 -0.121086
C  2.818392 0.359705 0.917779
C  3.440722 -1.711237 -0.174271
C  3.752274 0.101127 1.910606
C  -0.328112 -1.77071 -0.450053
C  4.356837 -1.963623 0.835541
C  4.51068 -1.060825 1.874499
C  1.967344 1.581972 1.048701
C  -2.606895 -0.960778 0.097907
C  -1.904226 -3.276531 0.543909
C  -4.724235 -0.374301 0.573079
C  -3.313938 1.139123 -0.255438
C  -6.058936 -0.756511 1.101104
C  1.966528 3.928787 0.980222
C  -1.832938 2.756943 -1.138045
H  -0.627599 0.245781 -0.791279
H  3.341968 -2.408701 -0.993384
H  3.882718 0.804001 2.722766
H  4.952694 -2.864945 0.800713
H  5.228623 -1.253939 2.659752
H  -1.165365 -3.576096 1.281967
H  -2.878982 -3.285798 1.009936
H  -1.904609 -3.989393 -0.277859
H  -5.985131 -0.949424 2.173118
H  -6.792527 0.028359 0.941235
H  -6.406604 -1.677614 0.635069
H  1.562297 4.076761 1.980746
H  2.702697 4.697606 0.768379
H  1.162714 3.98422 0.246539
H  -1.930709 3.795842 -1.439049
H  -1.534985 2.160568 -2.000062
H  -1.079859 2.681715 -0.354683
elementType: S O N C H
totalener: -1705.33882857 hartree
nucrepener: 2884.40929857 hartree
electener: -4589.74812715 hartree
oneelecener: -8072.07382791 hartree
twoeener: 3482.32570076 hartree
cpcmener: -0.05032383 hartree
kineticenergy: 1699.16768184 hartree
xcener: -140.060692377321 hartree
chargesum: -0.0000000
charge: 0.891800 -0.506551 -0.525053 -0.266831 -0.499945 -0.452421 -0.279568 -0.204747 -0.089333 -0.429154 -0.423957 -0.372111 -0.112204 0.069948 -0.024780 -0.189647 0.419433 -0.163609 -0.110339 0.457960 0.391087 -0.171960 0.322326 0.457578 -0.241335 -0.128251 -0.113166 0.233988 0.149330 0.156008 0.167425 0.167400 0.116301 0.126449 0.121356 0.112703 0.095796 0.105936 0.125047 0.135722 0.118960 0.139129 0.118361 0.104922
qa: 0.8918 -0.5066 -0.5251 -0.2668 -0.4999 -0.4524 -0.2796 -0.2047 -0.0893 -0.4292 -0.4240 -0.3721 -0.1122 0.0699 -0.0248 -0.1896 0.4194 -0.1636 -0.1103 0.4580 0.3911 -0.1720 0.3223 0.4576 -0.2413 -0.1283 -0.1132 0.2340 0.1493 0.1560 0.1674 0.1674 0.1163 0.1264 0.1214 0.1127 0.0958 0.1059 0.1250 0.1357 0.1190 0.1391 0.1184 0.1049
va: 5.7918 1.9918 1.9580 2.1383 2.0137 2.0358 2.1351 3.1113 3.2555 3.0083 2.9556 3.0067 3.7699 3.7104 3.8463 4.0199 4.2891 3.9490 3.8994 4.0687 4.1523 3.8391 3.9611 4.2303 3.9286 3.8593 3.8420 1.0383 1.0205 1.0024 0.9871 0.9858 0.9980 1.0253 0.9951 1.0011 1.0177 1.0056 0.9920 0.9941 0.9884 0.9975 0.9953 1.0028
dispcorr: -0.024869856 hartree
energy: -1705.363698427508
dipole: -6.87847 7.09965 0.22118 2.70343 -2.10456 0.59887 8.83383 -6.42251 2.41132
magnitude: 2.49440 au
magnitude: 6.34026 debye
