program: Orca
programVersion: 5.0.2
elementType: S O O O O O O N N N N N C C C C C C C C C C C C C C C H H H H H H H H H H H H H H H H H
charge: 0
multiplicity: 1
keywords: wb97x-d3
keywords: def2-TZVPP
keywords: def2/J RIJCOSX
keywords: DEFGRID2
keywords: scfconv7
keywords: smallprint printgap noloewdin
keywords: NOSOSCF
formula: C15H17N5O6S
InChI: InChI=1S/C15H17N5O6S/c1-9-16-13(18-14(17-9)26-4)20(2)15(22)19-27(23,24)11-8-6-5-7-10(11)12(21)25-3/h5-8,19H,1-4H3
44 atoms
S  1.666287 -0.28808 -1.578062
O  2.123659 -1.199692 -2.605872
O  1.648457 1.141575 -1.84274
O  2.225784 2.602424 1.161953
O  0.522398 -2.755372 -0.548063
O  0.422147 1.281463 1.087289
O  -3.005841 2.36757 -0.870063
N  0.088703 -0.641122 -1.190632
N  -1.565782 -1.95442 -0.148927
N  -3.501305 -1.167438 0.819631
N  -2.247885 0.242734 -0.56458
N  -4.228681 1.034119 0.420301
C  2.623116 -0.581712 -0.11426
C  2.592837 0.316424 0.953518
C  3.498369 -1.656244 -0.120296
C  3.456387 0.111095 2.020267
C  -0.264212 -1.834599 -0.628219
C  4.340877 -1.857281 0.962126
C  4.319706 -0.975329 2.028612
C  1.617007 1.442639 1.052138
C  -2.462213 -0.919572 0.041733
C  -1.925421 -3.275174 0.371567
C  -4.361564 -0.162706 0.971294
C  -3.146747 1.181338 -0.329344
C  -5.567051 -0.415353 1.801387
C  1.405266 3.762876 1.347983
C  -1.845806 2.643074 -1.658476
H  -0.594931 0.129877 -1.171266
H  3.536691 -2.335103 -0.959565
H  3.447271 0.794667 2.858847
H  5.017661 -2.700209 0.960395
H  4.980104 -1.125347 2.871483
H  -1.414214 -4.039476 -0.201925
H  -1.659362 -3.377796 1.422223
H  -2.99153 -3.428226 0.259663
H  -6.351313 -0.841473 1.171024
H  -5.359508 -1.131867 2.592632
H  -5.952707 0.505467 2.231505
H  0.728323 3.903135 0.505843
H  0.833628 3.695315 2.2726
H  2.090341 4.602697 1.405514
H  -1.967746 3.663369 -2.010091
H  -1.773028 1.974357 -2.515252
H  -0.938963 2.578013 -1.057909
elementType: S O N C H
totalener: -1705.33857296 hartree
nucrepener: 2910.65023535 hartree
electener: -4615.98880830 hartree
oneelecener: -8124.75160309 hartree
twoeener: 3508.76279479 hartree
cpcmener: -0.05004379 hartree
kineticenergy: 1699.18405982 hartree
xcener: -140.061917058093 hartree
chargesum: 0.0000000
charge: 0.895984 -0.509893 -0.525836 -0.269878 -0.494447 -0.456277 -0.277886 -0.206506 -0.100832 -0.422425 -0.421033 -0.373370 -0.126058 0.077214 -0.022675 -0.192478 0.405062 -0.161996 -0.107727 0.473325 0.405586 -0.171397 0.319902 0.453966 -0.245540 -0.127757 -0.107520 0.230098 0.151422 0.153520 0.167803 0.167548 0.116639 0.130601 0.116748 0.116995 0.101663 0.100013 0.122257 0.123297 0.134830 0.139132 0.126943 0.090984
qa: 0.8960 -0.5099 -0.5258 -0.2699 -0.4944 -0.4563 -0.2779 -0.2065 -0.1008 -0.4224 -0.4210 -0.3734 -0.1261 0.0772 -0.0227 -0.1925 0.4051 -0.1620 -0.1077 0.4733 0.4056 -0.1714 0.3199 0.4540 -0.2455 -0.1278 -0.1075 0.2301 0.1514 0.1535 0.1678 0.1675 0.1166 0.1306 0.1167 0.1170 0.1017 0.1000 0.1223 0.1233 0.1348 0.1391 0.1269 0.0910
va: 5.7924 1.9863 1.9573 2.1442 2.0164 2.0328 2.1325 3.1010 3.2436 2.9910 2.9548 3.0030 3.7838 3.6899 3.8448 4.0212 4.3099 3.9499 3.8993 4.0477 4.1301 3.8603 3.9665 4.2428 3.9298 3.8640 3.8454 1.0484 1.0192 1.0058 0.9870 0.9859 1.0074 0.9945 1.0066 0.9987 1.0115 1.0129 0.9832 0.9919 0.9941 0.9970 0.9935 0.9928
dispcorr: -0.025339932 hartree
energy: -1705.363912889065
dipole: -7.86160 7.75049 -0.11111 3.25620 -2.54563 0.71057 10.07036 -7.57513 2.49523
magnitude: 2.59681 au
magnitude: 6.60058 debye
