program: Orca
programVersion: 5.0.2
elementType: S O O O O O O N N N N N C C C C C C C C C C C C C C C H H H H H H H H H H H H H H H H H
charge: 0
multiplicity: 1
keywords: wb97x-d3
keywords: def2-TZVPP
keywords: def2/J RIJCOSX
keywords: DEFGRID2
keywords: scfconv7
keywords: smallprint printgap noloewdin
keywords: NOSOSCF
formula: C15H17N5O6S
InChI: InChI=1S/C15H17N5O6S/c1-9-16-13(18-14(17-9)26-4)20(2)15(22)19-27(23,24)11-8-6-5-7-10(11)12(21)25-3/h5-8,19H,1-4H3
44 atoms
S  1.615776 0.029548 1.681723
O  1.576413 1.482917 1.656302
O  2.058296 -0.645763 2.883504
O  2.182658 2.340369 -1.531187
O  0.53379 -2.59947 1.052682
O  0.393714 1.018777 -1.287791
O  -3.022322 2.466963 0.428364
N  0.05207 -0.418966 1.336652
N  -1.533661 -1.896372 0.416387
N  -3.418598 -1.28046 -0.754716
N  -2.25649 0.326108 0.486126
N  -4.180526 0.945766 -0.709257
C  2.605587 -0.529688 0.319241
C  2.569566 0.133173 -0.908615
C  3.495703 -1.567793 0.545376
C  3.440937 -0.272361 -1.909897
C  -0.26229 -1.689796 0.945568
C  4.347241 -1.971494 -0.471275
C  4.317168 -1.3270 -1.696167
C  1.584068 1.206829 -1.238508
C  -2.425867 -0.911716 0.03412
C  -1.859458 -3.278375 0.057262
C  -4.277906 -0.319015 -1.088665
C  -3.138447 1.212268 0.064399
C  -5.400243 -0.695471 -1.985935
C  1.355269 3.437533 -1.939503
C  -1.897832 2.857699 1.219979
H  -0.639989 0.327087 1.168603
H  3.537329 -2.063304 1.504355
H  3.427529 0.227482 -2.869368
H  5.035331 -2.786999 -0.297992
H  4.982105 -1.636929 -2.490687
H  -1.307831 -3.955866 0.697384
H  -2.91726 -3.45349 0.212893
H  -1.611624 -3.490251 -0.981109
H  -5.035613 -0.743899 -3.014624
H  -5.788491 -1.680451 -1.735072
H  -6.202977 0.035771 -1.948235
H  2.032543 4.265364 -2.123271
H  0.812496 3.201679 -2.853812
H  0.651999 3.711122 -1.153652
H  -1.863187 2.317637 2.165463
H  -2.032715 3.91709 1.417167
H  -0.966186 2.711273 0.673912
elementType: S O N C H
totalener: -1705.33818138 hartree
nucrepener: 2919.34476234 hartree
electener: -4624.68294373 hartree
oneelecener: -8142.09835693 hartree
twoeener: 3517.41541320 hartree
cpcmener: -0.04961850 hartree
kineticenergy: 1699.17857042 hartree
xcener: -140.060601057567 hartree
chargesum: -0.0000000
charge: 0.896467 -0.526414 -0.509707 -0.270039 -0.491162 -0.454377 -0.278135 -0.208340 -0.100672 -0.423242 -0.419813 -0.372239 -0.130033 0.079731 -0.023042 -0.191507 0.397891 -0.162144 -0.108949 0.473721 0.406178 -0.166774 0.322800 0.455422 -0.245630 -0.128810 -0.106993 0.228004 0.151562 0.153994 0.168034 0.167897 0.116873 0.115038 0.128715 0.115660 0.104607 0.097468 0.135168 0.123266 0.122692 0.127843 0.138887 0.090105
qa: 0.8965 -0.5264 -0.5097 -0.2700 -0.4912 -0.4544 -0.2781 -0.2083 -0.1007 -0.4232 -0.4198 -0.3722 -0.1300 0.0797 -0.0230 -0.1915 0.3979 -0.1621 -0.1089 0.4737 0.4062 -0.1668 0.3228 0.4554 -0.2456 -0.1288 -0.1070 0.2280 0.1516 0.1540 0.1680 0.1679 0.1169 0.1150 0.1287 0.1157 0.1046 0.0975 0.1352 0.1233 0.1227 0.1278 0.1389 0.0901
va: 5.7882 1.9568 1.9862 2.1434 2.0200 2.0342 2.1316 3.0920 3.2417 2.9870 2.9569 3.0046 3.7811 3.6950 3.8410 4.0227 4.3155 3.9485 3.8962 4.0450 4.1296 3.8583 3.9650 4.2398 3.9345 3.8646 3.8464 1.0533 1.0181 1.0048 0.9868 0.9858 1.0107 1.0049 0.9953 0.9992 1.0077 1.0152 0.9942 0.9919 0.9824 0.9932 0.9970 0.9914
dispcorr: -0.025622576 hartree
energy: -1705.363803959080
dipole: -7.37605 7.35068 -0.02537 1.31167 -1.10892 0.20275 -11.21283 8.54139 -2.67144
magnitude: 2.67924 au
magnitude: 6.81010 debye
