program: Orca
programVersion: 5.0.2
elementType: S O O O O O O N N N N N C C C C C C C C C C C C C C C H H H H H H H H H H H H H H H H H
charge: 0
multiplicity: 1
keywords: wb97x-d3
keywords: def2-TZVPP
keywords: def2/J RIJCOSX
keywords: DEFGRID2
keywords: scfconv7
keywords: smallprint printgap noloewdin
keywords: NOSOSCF
formula: C15H17N5O6S
InChI: InChI=1S/C15H17N5O6S/c1-9-16-13(18-14(17-9)26-4)20(2)15(22)19-27(23,24)11-8-6-5-7-10(11)12(21)25-3/h5-8,19H,1-4H3
44 atoms
S  1.586467 -0.234531 -1.460655
O  1.913058 -1.140854 -2.540682
O  1.571666 1.19822 -1.706118
O  2.631056 2.684781 0.882578
O  0.463995 -2.723371 -0.487884
O  0.765139 1.525554 1.309653
O  -3.0999 2.386065 -0.620671
N  0.051509 -0.553932 -0.905458
N  -1.626795 -1.947821 -0.016777
N  -3.757128 -1.321165 0.573182
N  -2.304741 0.272808 -0.33421
N  -4.490858 0.892908 0.262093
C  2.6746 -0.562944 -0.100335
C  2.805252 0.364696 0.933112
C  3.458064 -1.706227 -0.140893
C  3.732745 0.121514 1.935882
C  -0.318655 -1.796087 -0.476179
C  4.367778 -1.943182 0.878207
C  4.502621 -1.03307 1.913529
C  1.940936 1.578782 1.047702
C  -2.587743 -0.959977 0.073262
C  -2.017929 -3.28775 0.428466
C  -4.674222 -0.359828 0.651282
C  -3.286439 1.149262 -0.225393
C  -6.008798 -0.734417 1.185152
C  1.916361 3.9247 0.962076
C  -1.825261 2.763381 -1.146955
H  -0.622493 0.222536 -0.825395
H  3.374156 -2.408545 -0.957427
H  3.849665 0.830694 2.744616
H  4.974165 -2.837795 0.853985
H  5.2153 -1.214562 2.706257
H  -1.196301 -3.972791 0.2694
H  -2.265728 -3.283779 1.486445
H  -2.874781 -3.63968 -0.1388
H  -6.620604 -1.133181 0.372449
H  -5.926169 -1.511678 1.941483
H  -6.527378 0.126727 1.598482
H  1.126733 3.969454 0.211827
H  1.490009 4.072652 1.953575
H  2.648558 4.700732 0.76228
H  -1.563706 2.174104 -2.02527
H  -1.046242 2.671398 -0.39155
H  -1.924028 3.80658 -1.432122
elementType: S O N C H
totalener: -1705.33905344 hartree
nucrepener: 2886.10741963 hartree
electener: -4591.44647307 hartree
oneelecener: -8075.50587960 hartree
twoeener: 3484.05940653 hartree
cpcmener: -0.04984874 hartree
kineticenergy: 1699.17061171 hartree
xcener: -140.060911077840 hartree
chargesum: 0.0000000
charge: 0.892291 -0.506385 -0.524553 -0.266778 -0.496357 -0.452129 -0.280507 -0.206012 -0.093369 -0.429246 -0.420503 -0.375050 -0.112924 0.070429 -0.025392 -0.189346 0.405262 -0.163629 -0.110155 0.457410 0.414603 -0.154928 0.319977 0.452189 -0.247173 -0.128762 -0.109940 0.231601 0.149433 0.155440 0.167487 0.167373 0.119298 0.116284 0.115584 0.117169 0.102522 0.099189 0.119326 0.124944 0.136083 0.118683 0.101538 0.139023
qa: 0.8923 -0.5064 -0.5246 -0.2668 -0.4964 -0.4521 -0.2805 -0.2060 -0.0934 -0.4292 -0.4205 -0.3750 -0.1129 0.0704 -0.0254 -0.1893 0.4053 -0.1636 -0.1102 0.4574 0.4146 -0.1549 0.3200 0.4522 -0.2472 -0.1288 -0.1099 0.2316 0.1494 0.1554 0.1675 0.1674 0.1193 0.1163 0.1156 0.1172 0.1025 0.0992 0.1193 0.1249 0.1361 0.1187 0.1015 0.1390
va: 5.7930 1.9924 1.9579 2.1380 2.0203 2.0362 2.1346 3.1077 3.2481 2.9878 2.9632 2.9992 3.7722 3.7088 3.8477 4.0191 4.3017 3.9489 3.8989 4.0687 4.1227 3.8433 3.9721 4.2414 3.9308 3.8587 3.8418 1.0418 1.0204 1.0026 0.9871 0.9858 1.0223 0.9999 1.0003 0.9988 1.0104 1.0135 0.9881 0.9922 0.9941 0.9952 1.0031 0.9974
dispcorr: -0.024821172 hartree
energy: -1705.363874612096
dipole: -7.33556 7.50113 0.16557 2.83169 -2.24405 0.58764 8.51911 -6.25216 2.26694
magnitude: 2.34771 au
magnitude: 5.96742 debye
