program: Gaussian 09
title: 000069165
version: EM64L-G09RevD.01
frameworkgroup: C1[X(C12H10O2)]
method: RPBEPBE
basis: SDD
operation: Freq
keyword: #pfreq=noraman
keyword: PBEPBE/SDD
title: #p freq=noraman PBEPBE/SDD
converged: YES YES NO NO
title: Mulliken charges:
elementType: O O C C C C C C C C C C C C H H H H H H H H H H
charge: -0.438759 -0.438760 0.378787 0.378787 -0.508823 -0.508823 -0.423309 -0.423309 0.295109 0.295109 -0.197772 -0.197771 -0.411100 -0.411101 0.265643 0.265644 0.240116 0.240116 0.224203 0.224202 0.221746 0.221746 0.354160 0.354160
chargesum: 0.00000
title: Mulliken charges with hydrogens summed into heavy atoms:
elementType: O O C C C C C C C C C C C C
charge: -0.084599 -0.084599 0.378787 0.378787 -0.243180 -0.243180 -0.183193 -0.183193 0.295109 0.295109 0.026431 0.026431 -0.189354 -0.189354
polarizability: 2.18251581e+02 -2.16494091e-05 1.40689168e+02 5.04952267e+00 -8.93139305e-06 6.18361223e+01
1716.lowfreq: -8.7649 -0.0005 -0.0002 0.0006 2.0955 4.7219 48.4531 85.5840 102.9639
frequency: 48.4527 85.5817 102.9637 221.2833 230.1974 243.5385 291.6443 293.2591 357.8422 359.1945 406.3087 420.5735 461.7112 472.3871 515.2881 524.8077 561.5761 617.3106 629.9148 692.4200 693.5407 700.4766 773.9303 784.2280 813.7341 863.9305 872.8472 886.6767 893.5475 923.0069 959.5454 960.3984 981.2358 986.9872 1045.9304 1091.3310 1091.5561 1144.2862 1149.4568 1177.5044 1182.7824 1199.8099 1238.1849 1296.1829 1303.8224 1308.2820 1382.4423 1386.1847 1452.1991 1458.9379 1473.8857 1501.3716 1579.5225 1592.9889 1627.6712 1628.0740 3117.3619 3117.4548 3138.2864 3140.9187 3159.0820 3162.2849 3163.9439 3167.7724 3582.8917 3583.0147
redmass: 5.3383 4.3764 5.3862 4.4174 4.4287 4.4156 5.8396 6.0037 1.1168 1.1130 4.0823 3.3014 3.0117 3.4728 6.8383 7.3236 4.5787 7.0914 4.1713 2.0793 3.8295 2.3514 1.5493 1.5987 7.5647 1.3715 1.4300 1.4703 1.8152 3.1749 1.3198 1.3467 6.1132 5.6523 1.9353 1.5622 1.7495 1.3843 1.3734 1.0763 1.1210 1.5600 2.4767 1.3803 1.3277 3.2097 5.2203 8.6157 3.0163 2.3837 2.8074 3.1153 5.7321 6.9756 6.3510 6.1800 1.0881 1.0881 1.0903 1.0906 1.0963 1.0954 1.0945 1.0935 1.0660 1.0660
irintensity: 0.0120 6.5571 1.6972 0.7661 0.2174 0.0015 3.9287 0.2170 24.6103 263.0103 16.1709 2.5926 0.8633 7.9887 3.2459 2.4920 5.3839 4.8375 0.3569 51.3341 0.1472 6.2904 115.2307 8.6760 60.1332 2.7031 0.1683 33.6607 21.8038 48.9339 1.2389 0.0083 1.8767 0.9846 16.0685 30.6364 0.0967 141.4143 244.3235 5.6148 2.9399 11.3605 19.1183 36.1603 21.1098 32.4186 3.2369 22.1909 13.3933 52.9967 28.2770 13.3448 125.6341 20.6550 120.0988 19.5191 12.3645 9.5844 36.6011 0.8093 10.4224 26.2037 1.0673 0.8414 49.4971 26.0398
temp: 298.150 k
press: 1.00000 atm
elementType: 8 8 6 6 6 6 6 6 6 6 6 6 6 6 1 1 1 1 1 1 1 1 1 1
symmnumber: 1
zpe: 486137.0 jmol-1
zpe.correction: 0.185160 hartree
zpe.thermalcorrener: 0.196723 hartree
zpe.thermalcorrenthalpy: 0.197667 hartree
zpe.thermalcorrgfe: 0.147487 hartree
zpe.sumelectzpe: -612.743466 hartree
zpe.sumelectthermal: -612.731902 hartree
zpe.sumelectthermalent: -612.730958 hartree
zpe.sumelectthermalfe: -612.781139 hartree
dipole: 0.0000 -1.7622 0.0000
dipole: 1.7622
quadrupole: -47.3712 -80.6062 -87.4571
quadrupole: 0.0000 2.3277 0.0000
quadrupole: 24.4403 -8.7947 -15.6456 0.0000 2.3277 0.0000
hfenergy: -612.9286254 hartree
pointgroup: C01 [X(C12H10O2)]
dipole: -0.0000034 -0.693288 -0.0000015 debye
dipolederiv: -0.5606048 0.5542382 0.1621351 0.7653603 -0.9865551 -0.1366039 0.2224164 -0.1457088 -0.4594396 -0.5606171 -0.5542429 0.1621297 -0.7653671 -0.986546 0.1365908 0.2224104 0.1456994 -0.459434 0.4034486 -0.0445812 0.0049116 0.0366177 0.1727793 0.0753173 0.0280688 0.0345194 0.0272211 0.4034504 0.0445778 0.0049121 -0.036621 0.1727816 -0.0753146 0.0280668 -0.034517 0.0272194 -0.3856995 0.2959589 0.0906642 0.0521791 -0.1319996 0.0325315 0.0508146 0.0340402 -0.1512912 -0.3857044 -0.2959571 0.0906584 -0.0521775 -0.1319957 -0.0325323 0.050813 -0.0340413 -0.1512923 -0.3442275 -0.0850066 -0.0462287 -0.0740983 -0.1109968 0.0370981 -0.0826031 0.0349974 -0.1821981 -0.3442261 0.0850103 -0.0462276 0.0741029 -0.1109968 -0.0370964 -0.082602 -0.0349953 -0.1821993 0.6219237 -0.5696022 -0.1452893 -0.7654346 0.9120015 0.2148186 -0.2290565 0.2222874 0.1420836 0.6219387 0.5696069 -0.1452826 0.7654412 0.9119948 -0.2148025 -0.229047 -0.2222725 0.1420759 0.2196888 0.054245 0.0363592 -0.0603854 0.122415 0.071872 0.03424 0.0797267 -0.0930016 0.2196892 -0.0542468 0.0363566 0.0603832 0.1224187 -0.0718681 0.0342391 -0.0797219 -0.0930049 -0.106509 -0.076825 -0.0161703 0.2675927 -0.3233582 -0.0249383 0.0898075 -0.0334368 -0.2319255 -0.1065122 0.0768221 -0.0161691 -0.2675959 -0.3233575 0.024937 0.0898027 0.0334345 -0.2319248 0.0879894 -0.0711079 -0.0289807 -0.0687111 0.0140186 -0.0534835 -0.0369835 -0.0413857 0.1386852 0.0879913 0.0711073 -0.0289787 0.0687106 0.0140159 0.0534813 -0.0369822 0.0413839 0.138687 0.051818 0.0984856 0.0281227 0.0876134 -0.0154304 -0.0579173 0.036117 -0.0465306 0.1379762 0.051816 -0.0984866 0.0281215 -0.0876148 -0.0154305 0.0579141 0.0361159 0.0465273 0.1379781 0.0134516 -0.080609 -0.032102 -0.099405 -0.0517127 -0.0685044 -0.0383402 -0.0700268 0.1292749 0.0134534 0.0806093 -0.0320995 0.0994054 -0.0517183 0.0685012 -0.0383374 0.0700233 0.1292777 -0.1481981 0.0267959 -0.0091939 0.0539395 0.0822248 -0.0272598 -0.0078305 -0.0247498 0.1700102 -0.1481983 -0.0267931 -0.0091939 -0.0539366 0.0822249 0.0272581 -0.0078309 0.0247481 0.1700113 0.1469182 -0.1065884 -0.0442272 -0.1917474 0.3166132 -0.0280981 -0.0666494 -0.0240318 0.3726054 0.1469198 0.1065893 -0.0442273 0.1917489 0.3166093 0.028099 -0.0666494 0.0240308 0.3726053 unknown
polarizability: 218.2824528|-0.0004789|140.6891679|4.5461892|0.0007155|61.8052501 unknown
InChI: InChI=1S/C12H10O2/c13-11-5-1-3-9(7-11)10-4-2-6-12(14)8-10/h1-8,13-14H
charge 0 multiplicity 1
24 atoms
O  -3.540073 2.024331 0.50987
O  3.540088 2.024299 -0.509832
C  -0.745473 -0.350669 -0.041022
C  0.745462 -0.350679 0.041018
C  -1.483352 0.820959 0.262658
C  1.483355 0.820947 -0.262639
C  -1.454379 -1.524525 -0.425646
C  1.454354 -1.52455 0.425621
C  -2.891871 0.818714 0.182541
C  2.891874 0.818683 -0.182522
C  -2.861927 -1.516497 -0.500663
C  2.861902 -1.51654 0.500636
C  -3.596869 -0.348472 -0.197992
C  3.596859 -0.348518 0.197987
H  -0.983447 1.736075 0.593893
H  0.983461 1.736074 -0.593858
H  -0.901823 -2.429236 -0.698394
H  0.901789 -2.429261 0.698353
H  -3.395323 -2.422917 -0.807478
H  3.395288 -2.422973 0.807431
H  -4.692887 -0.347502 -0.257591
H  4.692877 -0.347562 0.257584
H  -4.521731 1.927981 0.43379
H  4.521746 1.927941 -0.433745
