program: Orca
programVersion: 5.0.2
elementType: S O O O O O O N N N N N C C C C C C C C C C C C C C C H H H H H H H H H H H H H H H H H
charge: 0
multiplicity: 1
keywords: wb97x-d3
keywords: def2-TZVPP
keywords: def2/J RIJCOSX
keywords: DEFGRID2
keywords: scfconv7
keywords: smallprint printgap noloewdin
keywords: NOSOSCF
formula: C15H17N5O6S
InChI: InChI=1S/C15H17N5O6S/c1-9-16-13(18-14(17-9)26-4)20(2)15(22)19-27(23,24)11-8-6-5-7-10(11)12(21)25-3/h5-8,19H,1-4H3
44 atoms
S  1.785997 -0.33214 -1.541685
O  2.009891 -1.3644 -2.5311
O  1.896069 1.065859 -1.920915
O  1.239579 1.650864 0.894864
O  0.453898 -2.600343 -0.268073
O  3.164185 2.772658 0.68764
O  -5.686601 0.192569 0.836999
N  0.241685 -0.462625 -0.942816
N  -1.541642 -1.5692 0.113273
N  -2.049351 0.610307 -0.595685
N  -3.638721 -0.722495 0.483358
N  -4.201039 1.454792 -0.226262
C  2.881821 -0.624475 -0.175633
C  3.190419 0.395371 0.726897
C  3.528722 -1.849397 -0.117309
C  4.164256 0.160787 1.688163
C  -0.229826 -1.605969 -0.36969
C  4.47636 -2.076231 0.868974
C  4.793878 -1.072716 1.768524
C  2.543781 1.74312 0.738201
C  -2.427129 -0.521134 -0.00905
C  -2.033146 -2.778918 0.774463
C  -2.970109 1.565666 -0.691126
C  -4.470713 0.294043 0.357949
C  -2.579954 2.842162 -1.346691
C  0.484049 2.864578 0.897308
C  -6.068727 -1.013029 1.499344
H  -0.387637 0.358397 -0.993743
H  3.311702 -2.624981 -0.837413
H  4.42334 0.943684 2.389049
H  4.972476 -3.035776 0.920366
H  5.541103 -1.242619 2.532103
H  -1.206762 -3.45756 0.940158
H  -2.472992 -2.528632 1.735064
H  -2.780694 -3.279681 0.162272
H  -2.53236 3.641759 -0.60506
H  -1.611432 2.761129 -1.833438
H  -3.329155 3.135302 -2.081771
H  0.570583 3.383695 -0.057302
H  -0.547748 2.57124 1.064469
H  0.80145 3.527838 1.702042
H  -5.450404 -1.200499 2.376969
H  -6.016852 -1.871497 0.830001
H  -7.098682 -0.860704 1.810602
elementType: S O N C H
totalener: -1705.34279245 hartree
nucrepener: 2869.20410951 hartree
electener: -4574.54690197 hartree
oneelecener: -8040.47396771 hartree
twoeener: 3465.92706574 hartree
cpcmener: -0.04588773 hartree
kineticenergy: 1699.19821122 hartree
xcener: -140.063720443255 hartree
chargesum: 0.0000000
charge: 0.887922 -0.497315 -0.517946 -0.263903 -0.471427 -0.430292 -0.272276 -0.199546 -0.101427 -0.407081 -0.431715 -0.377410 -0.155489 0.079635 0.004105 -0.205147 0.395768 -0.167189 -0.103533 0.454669 0.416103 -0.159520 0.324946 0.439131 -0.267555 -0.133330 -0.115993 0.216473 0.144033 0.149812 0.163619 0.163620 0.120754 0.113673 0.120655 0.114458 0.101694 0.122745 0.126359 0.120058 0.132576 0.116473 0.116308 0.132501
qa: 0.8879 -0.4973 -0.5179 -0.2639 -0.4714 -0.4303 -0.2723 -0.1995 -0.1014 -0.4071 -0.4317 -0.3774 -0.1555 0.0796 0.0041 -0.2051 0.3958 -0.1672 -0.1035 0.4547 0.4161 -0.1595 0.3249 0.4391 -0.2676 -0.1333 -0.1160 0.2165 0.1440 0.1498 0.1636 0.1636 0.1208 0.1137 0.1207 0.1145 0.1017 0.1227 0.1264 0.1201 0.1326 0.1165 0.1163 0.1325
va: 5.8064 2.0072 1.9676 2.1158 2.0507 2.0764 2.1340 3.0959 3.2466 3.0005 2.9418 3.0021 3.8406 3.6883 3.8366 4.0265 4.3132 3.9572 3.9019 4.1111 4.1124 3.8464 3.8950 4.2803 3.9518 3.8504 3.8497 1.0634 1.0244 1.0075 0.9888 0.9873 1.0223 0.9985 0.9964 0.9982 1.0092 1.0102 0.9908 0.9951 0.9973 0.9939 0.9945 0.9949
dispcorr: -0.025030984 hartree
energy: -1705.367823436075
dipole: -12.99948 10.73677 -2.26271 0.75527 -1.54834 -0.79306 9.96680 -7.08925 2.87755
magnitude: 3.74554 au
magnitude: 9.52042 debye
