program: Orca
programVersion: 5.0.2
elementType: S O O O O O O N N N N N C C C C C C C C C C C C C C C H H H H H H H H H H H H H H H H H
charge: 0
multiplicity: 1
keywords: wb97x-d3
keywords: def2-TZVPP
keywords: def2/J RIJCOSX
keywords: DEFGRID2
keywords: scfconv7
keywords: smallprint printgap noloewdin
keywords: NOSOSCF
formula: C15H17N5O6S
InChI: InChI=1S/C15H17N5O6S/c1-9-16-13(18-14(17-9)26-4)20(2)15(22)19-27(23,24)11-8-6-5-7-10(11)12(21)25-3/h5-8,19H,1-4H3
44 atoms
S  1.622462 -0.119592 -1.499001
O  1.904452 -0.961034 -2.642225
O  1.620681 1.324488 -1.658129
O  0.948149 1.392079 1.21445
O  0.522959 -2.608348 -0.419159
O  2.814553 2.615767 1.339878
O  -3.214231 2.299181 -1.175913
N  0.101126 -0.456986 -0.916476
N  -1.52482 -1.78197 0.149727
N  -3.635597 -1.114068 0.76279
N  -2.307328 0.321015 -0.519955
N  -4.479692 0.973754 0.084152
C  2.755767 -0.553499 -0.201286
C  2.982798 0.295693 0.883605
C  3.504279 -1.708559 -0.370861
C  3.975009 -0.042328 1.795135
C  -0.249433 -1.675545 -0.41375
C  4.472694 -2.041952 0.562391
C  4.706317 -1.210731 1.644706
C  2.250121 1.571269 1.144481
C  -2.513098 -0.821415 0.127867
C  -1.845074 -3.038974 0.828746
C  -4.583838 -0.181715 0.721642
C  -3.320877 1.167165 -0.525672
C  -5.864146 -0.478176 1.417848
C  0.135834 2.544992 1.44928
C  -2.015679 2.573236 -1.902572
H  -0.595807 0.300078 -0.915761
H  3.345927 -2.349294 -1.225934
H  4.169861 0.608803 2.63709
H  5.048201 -2.948287 0.432668
H  5.46587 -1.463407 2.372321
H  -2.690029 -3.529804 0.351825
H  -0.988752 -3.699055 0.781715
H  -2.08549 -2.855361 1.872876
H  -6.39205 0.436734 1.676721
H  -6.51045 -1.060305 0.756367
H  -5.695278 -1.073408 2.312984
H  0.263551 3.288436 0.662894
H  -0.890543 2.190223 1.454072
H  0.362407 2.99638 2.415209
H  -2.18494 3.52559 -2.397521
H  -1.818059 1.80856 -2.653882
H  -1.157168 2.666126 -1.237468
elementType: S O N C H
totalener: -1705.34095223 hartree
nucrepener: 2907.65735605 hartree
electener: -4612.99830828 hartree
oneelecener: -8116.83445694 hartree
twoeener: 3503.83614866 hartree
cpcmener: -0.04469349 hartree
kineticenergy: 1699.19514684 hartree
xcener: -140.062777496500 hartree
chargesum: -0.0000000
charge: 0.890203 -0.497732 -0.518045 -0.261720 -0.469125 -0.431518 -0.268319 -0.188570 -0.095525 -0.427392 -0.426325 -0.365705 -0.161381 0.084694 0.005385 -0.206289 0.387220 -0.166117 -0.102170 0.457625 0.414702 -0.154900 0.315112 0.441782 -0.247928 -0.143480 -0.120285 0.213476 0.145984 0.148923 0.163520 0.163954 0.115603 0.119186 0.113437 0.100163 0.114612 0.101776 0.125271 0.120831 0.141185 0.137978 0.123631 0.106275
qa: 0.8902 -0.4977 -0.5180 -0.2617 -0.4691 -0.4315 -0.2683 -0.1886 -0.0955 -0.4274 -0.4263 -0.3657 -0.1614 0.0847 0.0054 -0.2063 0.3872 -0.1661 -0.1022 0.4576 0.4147 -0.1549 0.3151 0.4418 -0.2479 -0.1435 -0.1203 0.2135 0.1460 0.1489 0.1635 0.1640 0.1156 0.1192 0.1134 0.1002 0.1146 0.1018 0.1253 0.1208 0.1412 0.1380 0.1236 0.1063
va: 5.7972 2.0053 1.9686 2.1138 2.0548 2.0738 2.1408 3.0991 3.2398 2.9897 2.9386 3.0048 3.8535 3.6745 3.8201 4.0289 4.3182 3.9595 3.9035 4.1040 4.1148 3.8432 3.9743 4.2485 3.9295 3.8418 3.8581 1.0545 1.0235 1.0090 0.9888 0.9872 1.0001 1.0231 1.0005 1.0135 0.9993 1.0101 0.9871 0.9971 0.9978 0.9972 0.9937 0.9786
dispcorr: -0.025945865 hartree
energy: -1705.366898095714
dipole: -11.62963 10.13469 -1.49494 -0.54395 -0.24607 -0.79002 9.21123 -7.07541 2.13582
magnitude: 2.72410 au
magnitude: 6.92411 debye
