program: Orca
programVersion: 5.0.2
elementType: S O O O O O O N N N N N C C C C C C C C C C C C C C C H H H H H H H H H H H H H H H H H
charge: 0
multiplicity: 1
keywords: wb97x-d3
keywords: def2-TZVPP
keywords: def2/J RIJCOSX
keywords: DEFGRID2
keywords: scfconv7
keywords: smallprint printgap noloewdin
keywords: NOSOSCF
formula: C15H17N5O6S
InChI: InChI=1S/C15H17N5O6S/c1-9-16-13(18-14(17-9)26-4)20(2)15(22)19-27(23,24)11-8-6-5-7-10(11)12(21)25-3/h5-8,19H,1-4H3
44 atoms
S  1.615324 -0.104435 -1.490949
O  1.891245 -0.937878 -2.641207
O  1.612303 1.340256 -1.642664
O  0.959432 1.384437 1.227695
O  0.523211 -2.596666 -0.400044
O  2.824721 2.608295 1.368338
O  -3.220713 2.294844 -1.190651
N  0.097945 -0.446096 -0.901094
N  -1.523063 -1.769409 0.173146
N  -3.646882 -1.114067 0.755547
N  -2.310926 0.325559 -0.513601
N  -4.496157 0.96498 0.055715
C  2.756969 -0.547709 -0.203273
C  2.994243 0.292862 0.886215
C  3.50244 -1.702488 -0.387919
C  3.99455 -0.052882 1.785931
C  -0.248637 -1.66344 -0.393856
C  4.478341 -2.044282 0.534106
C  4.723131 -1.220878 1.61997
C  2.261953 1.565118 1.161814
C  -2.517581 -0.816283 0.135047
C  -1.839795 -3.023727 0.858867
C  -4.600806 -0.188545 0.697019
C  -3.330091 1.164736 -0.537527
C  -5.8891 -0.490567 1.375857
C  0.14581 2.536452 1.460431
C  -2.012453 2.57293 -1.899586
H  -0.604311 0.307037 -0.902048
H  3.334538 -2.336222 -1.246361
H  4.197547 0.591519 2.631157
H  5.051235 -2.950554 0.392729
H  5.48925 -1.479735 2.33845
H  -0.96825 -3.665338 0.851263
H  -2.119038 -2.829764 1.891164
H  -2.657804 -3.540114 0.361759
H  -6.420355 0.4224 1.634908
H  -6.527501 -1.067187 0.701969
H  -5.730977 -1.092383 2.268449
H  0.281326 3.283357 0.678464
H  -0.880928 2.182684 1.45384
H  0.363055 2.983505 2.43056
H  -1.798535 1.806197 -2.644405
H  -1.165305 2.673605 -1.221131
H  -2.179085 3.522125 -2.401428
elementType: S O N C H
totalener: -1705.34086501 hartree
nucrepener: 2907.56605579 hartree
electener: -4612.90692079 hartree
oneelecener: -8116.65149692 hartree
twoeener: 3503.74457612 hartree
cpcmener: -0.04456293 hartree
kineticenergy: 1699.19740843 hartree
xcener: -140.063312673510 hartree
chargesum: -0.0000000
charge: 0.889768 -0.497928 -0.518006 -0.262057 -0.468872 -0.431313 -0.268338 -0.187760 -0.095665 -0.427125 -0.425887 -0.365797 -0.161685 0.085758 0.005758 -0.206465 0.387040 -0.166248 -0.101918 0.457569 0.414921 -0.155583 0.315290 0.441601 -0.248104 -0.142576 -0.120397 0.212299 0.145578 0.148827 0.163513 0.163996 0.118897 0.113286 0.116597 0.100304 0.114765 0.101678 0.125098 0.119948 0.141228 0.123457 0.106699 0.137852
qa: 0.8898 -0.4979 -0.5180 -0.2621 -0.4689 -0.4313 -0.2683 -0.1878 -0.0957 -0.4271 -0.4259 -0.3658 -0.1617 0.0858 0.0058 -0.2065 0.3870 -0.1662 -0.1019 0.4576 0.4149 -0.1556 0.3153 0.4416 -0.2481 -0.1426 -0.1204 0.2123 0.1456 0.1488 0.1635 0.1640 0.1189 0.1133 0.1166 0.1003 0.1148 0.1017 0.1251 0.1199 0.1412 0.1235 0.1067 0.1379
va: 5.7973 2.0051 1.9688 2.1134 2.0552 2.0741 2.1412 3.0983 3.2398 2.9900 2.9395 3.0046 3.8541 3.6710 3.8189 4.0291 4.3182 3.9599 3.9030 4.1040 4.1146 3.8437 3.9738 4.2492 3.9295 3.8419 3.8579 1.0565 1.0237 1.0091 0.9888 0.9872 1.0228 1.0007 0.9996 1.0133 0.9992 1.0103 0.9874 0.9975 0.9977 0.9936 0.9789 0.9974
dispcorr: -0.025957392 hartree
energy: -1705.366822397851
dipole: -11.59566 10.11953 -1.47613 -0.61353 -0.19166 -0.80519 9.11993 -7.00241 2.11751
magnitude: 2.70391 au
magnitude: 6.87280 debye
