program: Orca
programVersion: 5.0.2
elementType: S O O O O O O N N N N N C C C C C C C C C C C C C C C H H H H H H H H H H H H H H H H H
charge: 0
multiplicity: 1
keywords: wb97x-d3
keywords: def2-TZVPP
keywords: def2/J RIJCOSX
keywords: DEFGRID2
keywords: scfconv7
keywords: smallprint printgap noloewdin
keywords: NOSOSCF
formula: C15H17N5O6S
InChI: InChI=1S/C15H17N5O6S/c1-9-16-13(18-14(17-9)26-4)20(2)15(22)19-27(23,24)11-8-6-5-7-10(11)12(21)25-3/h5-8,19H,1-4H3
44 atoms
S  1.625348 -0.126619 -1.503142
O  1.910088 -0.97315 -2.641805
O  1.622901 1.316719 -1.668571
O  0.94318 1.39705 1.204422
O  0.524227 -2.615169 -0.42835
O  2.810024 2.62039 1.326105
O  -3.213416 2.293737 -1.176627
N  0.103194 -0.462797 -0.921687
N  -1.523392 -1.789614 0.141762
N  -3.634791 -1.123913 0.754503
N  -2.306322 0.314137 -0.525037
N  -4.479411 0.964729 0.079085
C  2.755522 -0.55471 -0.200613
C  2.978717 0.298356 0.881993
C  3.504956 -1.710204 -0.363491
C  3.968258 -0.036062 1.797875
C  -0.247463 -1.68178 -0.419915
C  4.470022 -2.040327 0.574415
C  4.699819 -1.2052 1.654571
C  2.245583 1.57499 1.135783
C  -2.511554 -0.828926 0.121341
C  -1.844743 -3.048707 0.816503
C  -4.583195 -0.192051 0.714825
C  -3.319696 1.160815 -0.527709
C  -5.839134 -0.460875 1.464321
C  0.132557 2.55148 1.437744
C  -2.016972 2.567332 -1.906938
H  -0.593378 0.294459 -0.921169
H  3.349616 -2.354006 -1.21682
H  4.160097 0.618032 2.638234
H  5.04646 -2.946778 0.449607
H  5.457115 -1.455064 2.385493
H  -2.08472 -2.868715 1.861436
H  -2.690382 -3.536879 0.337952
H  -0.989102 -3.709478 0.766887
H  -5.724399 -0.116229 2.495059
H  -6.679613 0.075823 1.02997
H  -6.058055 -1.525934 1.49814
H  0.259933 3.293092 0.649469
H  -0.894231 2.198143 1.445153
H  0.361148 3.004543 2.402457
H  -1.15575 2.657117 -1.244874
H  -2.186311 3.521186 -2.398998
H  -1.823239 1.804096 -2.660802
elementType: S O N C H
totalener: -1705.34094871 hartree
nucrepener: 2907.68646657 hartree
electener: -4613.02741528 hartree
oneelecener: -8116.88328161 hartree
twoeener: 3503.85586633 hartree
cpcmener: -0.04475806 hartree
kineticenergy: 1699.19390675 hartree
xcener: -140.062514239809 hartree
chargesum: -0.0000000
charge: 0.890251 -0.497477 -0.517873 -0.261874 -0.469171 -0.431429 -0.268511 -0.188857 -0.095525 -0.426855 -0.426857 -0.366602 -0.161893 0.085057 0.005634 -0.206574 0.387342 -0.166212 -0.102185 0.457679 0.416471 -0.154916 0.313693 0.440497 -0.246237 -0.143750 -0.120267 0.213814 0.146088 0.148843 0.163558 0.163943 0.113627 0.115416 0.119255 0.114631 0.100157 0.101754 0.125343 0.120975 0.141196 0.106020 0.138028 0.123796
qa: 0.8903 -0.4975 -0.5179 -0.2619 -0.4692 -0.4314 -0.2685 -0.1889 -0.0955 -0.4269 -0.4269 -0.3666 -0.1619 0.0851 0.0056 -0.2066 0.3873 -0.1662 -0.1022 0.4577 0.4165 -0.1549 0.3137 0.4405 -0.2462 -0.1438 -0.1203 0.2138 0.1461 0.1488 0.1636 0.1639 0.1136 0.1154 0.1193 0.1146 0.1002 0.1018 0.1253 0.1210 0.1412 0.1060 0.1380 0.1238
va: 5.7974 2.0056 1.9688 2.1138 2.0547 2.0738 2.1405 3.0995 3.2400 2.9905 2.9391 3.0029 3.8542 3.6747 3.8201 4.0290 4.3181 3.9596 3.9034 4.1037 4.1114 3.8433 3.9773 4.2508 3.9271 3.8420 3.8581 1.0540 1.0235 1.0089 0.9888 0.9872 1.0005 1.0001 1.0231 0.9996 1.0131 1.0110 0.9869 0.9970 0.9978 0.9784 0.9972 0.9937
dispcorr: -0.025940173 hartree
energy: -1705.366888886281
dipole: -11.54102 10.07453 -1.46649 -0.39570 -0.34826 -0.74396 9.45124 -7.23707 2.21416
magnitude: 2.75800 au
magnitude: 7.01029 debye
