program: Orca
programVersion: 5.0.2
elementType: S O O O O O O N N N N N C C C C C C C C C C C C C C C H H H H H H H H H H H H H H H H H
charge: 0
multiplicity: 1
keywords: wb97x-d3
keywords: def2-TZVPP
keywords: def2/J RIJCOSX
keywords: DEFGRID2
keywords: scfconv7
keywords: smallprint printgap noloewdin
keywords: NOSOSCF
formula: C15H17N5O6S
InChI: InChI=1S/C15H17N5O6S/c1-9-16-13(18-14(17-9)26-4)20(2)15(22)19-27(23,24)11-8-6-5-7-10(11)12(21)25-3/h5-8,19H,1-4H3
44 atoms
S  1.625128 -0.128763 -1.501551
O  1.910739 -0.975854 -2.639643
O  1.622949 1.314432 -1.668036
O  0.945801 1.40166 1.199666
O  0.523974 -2.61566 -0.424475
O  2.814803 2.620754 1.327078
O  -3.210628 2.299102 -1.163603
N  0.102196 -0.464427 -0.921724
N  -1.525893 -1.791513 0.139211
N  -3.628056 -1.115893 0.772664
N  -2.306017 0.315558 -0.520646
N  -4.469616 0.976645 0.105911
C  2.754923 -0.556089 -0.198337
C  2.97976 0.298517 0.882757
C  3.503232 -1.712493 -0.359911
C  3.969634 -0.035424 1.798472
C  -0.248967 -1.683286 -0.419934
C  4.469109 -2.041719 0.577489
C  4.700721 -1.204947 1.655987
C  2.248658 1.576659 1.134541
C  -2.510352 -0.826717 0.127875
C  -1.848664 -3.05142 0.811579
C  -4.57296 -0.179724 0.74179
C  -3.315828 1.166151 -0.514702
C  -5.847779 -0.472621 1.449497
C  0.137432 2.558543 1.428814
C  -2.019642 2.567783 -1.904554
H  -0.594361 0.292877 -0.922046
H  3.346427 -2.357926 -1.211715
H  4.163088 0.62014 2.63732
H  5.044317 -2.949125 0.453901
H  5.458741 -1.454046 2.386423
H  -2.713265 -3.522107 0.350125
H  -1.004929 -3.724635 0.733733
H  -2.059465 -2.877962 1.864122
H  -5.671481 -1.062143 2.347057
H  -6.374271 0.443469 1.70689
H  -6.498591 -1.059757 0.796944
H  0.365316 3.014061 2.39258
H  0.267959 3.297689 0.638741
H  -0.890189 2.207711 1.435601
H  -2.188886 3.523057 -2.393861
H  -1.836979 1.804404 -2.661009
H  -1.151695 2.652412 -1.250656
elementType: S O N C H
totalener: -1705.34099681 hartree
nucrepener: 2907.67579484 hartree
electener: -4613.01679166 hartree
oneelecener: -8116.87295453 hartree
twoeener: 3503.85616287 hartree
cpcmener: -0.04468981 hartree
kineticenergy: 1699.19411175 hartree
xcener: -140.062593458603 hartree
chargesum: 0.0000000
charge: 0.890541 -0.497619 -0.517965 -0.262008 -0.469459 -0.431535 -0.268396 -0.189044 -0.095457 -0.427488 -0.426235 -0.365503 -0.162203 0.084850 0.005662 -0.206452 0.387332 -0.166334 -0.102182 0.458184 0.414505 -0.154781 0.315059 0.441935 -0.247731 -0.143407 -0.119945 0.213846 0.145989 0.149019 0.163536 0.163942 0.114912 0.119456 0.113682 0.101861 0.100073 0.114489 0.141006 0.125365 0.120953 0.138036 0.123970 0.105543
qa: 0.8905 -0.4976 -0.5180 -0.2620 -0.4695 -0.4315 -0.2684 -0.1890 -0.0955 -0.4275 -0.4262 -0.3655 -0.1622 0.0848 0.0057 -0.2065 0.3873 -0.1663 -0.1022 0.4582 0.4145 -0.1548 0.3151 0.4419 -0.2477 -0.1434 -0.1199 0.2138 0.1460 0.1490 0.1635 0.1639 0.1149 0.1195 0.1137 0.1019 0.1001 0.1145 0.1410 0.1254 0.1210 0.1380 0.1240 0.1055
va: 5.7972 2.0055 1.9687 2.1138 2.0545 2.0738 2.1405 3.0991 3.2396 2.9896 2.9386 3.0051 3.8540 3.6745 3.8202 4.0290 4.3183 3.9598 3.9037 4.1030 4.1150 3.8431 3.9744 4.2479 3.9294 3.8419 3.8581 1.0541 1.0236 1.0090 0.9888 0.9872 1.0005 1.0232 1.0002 1.0100 1.0136 0.9994 0.9979 0.9870 0.9970 0.9972 0.9937 0.9785
dispcorr: -0.025936421 hartree
energy: -1705.366933234770
dipole: -11.64204 10.13688 -1.50516 -0.50486 -0.27672 -0.78158 9.20667 -7.07386 2.13282
magnitude: 2.72494 au
magnitude: 6.92624 debye
