program: Orca
programVersion: 5.0.2
elementType: S O O O O O O N N N N N C C C C C C C C C C C C C C C H H H H H H H H H H H H H H H H H
charge: 0
multiplicity: 1
keywords: wb97x-d3
keywords: def2-TZVPP
keywords: def2/J RIJCOSX
keywords: DEFGRID2
keywords: scfconv7
keywords: smallprint printgap noloewdin
keywords: NOSOSCF
formula: C15H17N5O6S
InChI: InChI=1S/C15H17N5O6S/c1-9-16-13(18-14(17-9)26-4)20(2)15(22)19-27(23,24)11-8-6-5-7-10(11)12(21)25-3/h5-8,19H,1-4H3
44 atoms
S  1.847552 -0.274232 -1.538067
O  2.247633 -1.24724 -2.529517
O  1.936501 1.143864 -1.837895
O  2.861896 2.721884 0.716835
O  0.453268 -2.695573 -0.683779
O  0.867421 1.746339 0.99597
O  -5.602885 -0.008528 0.954751
N  0.247135 -0.496893 -1.140374
N  -1.586195 -1.740478 -0.348255
N  -1.992746 0.564808 -0.493261
N  -3.619859 -0.910168 0.310034
N  -4.058425 1.405379 0.218576
C  2.751456 -0.580856 -0.045262
C  2.832478 0.407037 0.935946
C  3.435883 -1.779162 0.08359
C  3.611223 0.168184 2.058747
C  -0.240043 -1.703794 -0.723655
C  4.19422 -2.009598 1.220976
C  4.280064 -1.038841 2.204946
C  2.063266 1.689163 0.867666
C  -2.415115 -0.651973 -0.179326
C  -2.135853 -3.053375 -0.008271
C  -2.844009 1.565461 -0.268744
C  -4.390714 0.144973 0.480465
C  -2.381283 2.935586 -0.610393
C  2.258867 4.017815 0.645842
C  -6.060642 -1.322284 1.272062
H  -0.369243 0.33174 -1.053443
H  3.390476 -2.528984 -0.693218
H  3.690192 0.923701 2.830002
H  4.723172 -2.946649 1.328544
H  4.87661 -1.213965 3.090179
H  -2.292755 -3.147165 1.064795
H  -3.082165 -3.204716 -0.519344
H  -1.446692 -3.82427 -0.328214
H  -3.069044 3.68811 -0.234184
H  -1.386304 3.11564 -0.204498
H  -2.309262 3.041775 -1.694691
H  3.07794 4.718007 0.510203
H  1.57944 4.088382 -0.203473
H  1.724339 4.258806 1.564504
H  -5.446984 -1.784032 2.045395
H  -6.077495 -1.964024 0.391371
H  -7.073809 -1.195985 1.644146
elementType: S O N C H
totalener: -1705.34349332 hartree
nucrepener: 2857.18529698 hartree
electener: -4562.52879030 hartree
oneelecener: -8018.02085659 hartree
twoeener: 3455.49206629 hartree
cpcmener: -0.04220539 hartree
kineticenergy: 1699.19123406 hartree
xcener: -140.061194634999 hartree
chargesum: 0.0000000
charge: 0.884124 -0.492383 -0.513901 -0.262817 -0.468653 -0.431456 -0.271140 -0.212503 -0.102566 -0.409346 -0.432257 -0.366407 -0.120053 0.071487 -0.021462 -0.188499 0.394542 -0.162236 -0.110933 0.441417 0.407710 -0.159892 0.319986 0.450294 -0.244853 -0.129979 -0.117052 0.216300 0.146679 0.149761 0.163953 0.163675 0.120597 0.113739 0.120173 0.101434 0.097214 0.114268 0.134225 0.120177 0.120743 0.116388 0.117082 0.132421
qa: 0.8841 -0.4924 -0.5139 -0.2628 -0.4687 -0.4315 -0.2711 -0.2125 -0.1026 -0.4093 -0.4323 -0.3664 -0.1201 0.0715 -0.0215 -0.1885 0.3945 -0.1622 -0.1109 0.4414 0.4077 -0.1599 0.3200 0.4503 -0.2449 -0.1300 -0.1171 0.2163 0.1467 0.1498 0.1640 0.1637 0.1206 0.1137 0.1202 0.1014 0.0972 0.1143 0.1342 0.1202 0.1207 0.1164 0.1171 0.1324
va: 5.8149 2.0108 1.9738 2.1393 2.0477 2.0676 2.1337 3.0887 3.2400 3.0159 2.9393 3.0160 3.7857 3.7144 3.8563 4.0222 4.3157 3.9496 3.9013 4.1026 4.1280 3.8507 3.9359 4.2571 3.9330 3.8588 3.8500 1.0750 1.0227 1.0044 0.9884 0.9872 0.9965 0.9989 1.0204 1.0193 1.0110 1.0001 0.9941 0.9906 0.9930 0.9946 0.9935 0.9948
dispcorr: -0.023894896 hartree
energy: -1705.367388220943
dipole: -8.94709 8.20867 -0.73842 2.67842 -2.62684 0.05158 9.06670 -6.52392 2.54278
magnitude: 2.64833 au
magnitude: 6.73151 debye
