program: Orca
programVersion: 5.0.2
elementType: S O O O O O O N N N N N C C C C C C C C C C C C C C C H H H H H H H H H H H H H H H H H
charge: 0
multiplicity: 1
keywords: wb97x-d3
keywords: def2-TZVPP
keywords: def2/J RIJCOSX
keywords: DEFGRID2
keywords: scfconv7
keywords: smallprint printgap noloewdin
keywords: NOSOSCF
formula: C15H17N5O6S
InChI: InChI=1S/C15H17N5O6S/c1-9-16-13(18-14(17-9)26-4)20(2)15(22)19-27(23,24)11-8-6-5-7-10(11)12(21)25-3/h5-8,19H,1-4H3
44 atoms
S  1.847034 -0.313824 -1.575567
O  2.26853 -1.303074 -2.541894
O  1.928224 1.098338 -1.904449
O  2.788468 2.735271 0.627086
O  0.463527 -2.718246 -0.648232
O  0.802708 1.743859 0.91062
O  -5.493312 0.056815 1.159115
N  0.243722 -0.540023 -1.190951
N  -1.570615 -1.75469 -0.314517
N  -1.995655 0.536021 -0.569237
N  -3.555137 -0.884195 0.439228
N  -4.012695 1.419645 0.223118
C  2.730338 -0.581543 -0.063058
C  2.782144 0.425347 0.900426
C  3.421784 -1.771124 0.103324
C  3.540737 0.21588 2.04276
C  -0.232787 -1.730068 -0.717767
C  4.159653 -1.97213 1.259501
C  4.217829 -0.981456 2.225536
C  2.000172 1.697089 0.793953
C  -2.389569 -0.657784 -0.149966
C  -2.101991 -3.054033 0.097844
C  -2.834495 1.548959 -0.353108
C  -4.318507 0.179155 0.591565
C  -2.395472 2.894062 -0.807378
C  2.170548 4.021911 0.523586
C  -5.919118 -1.232073 1.599436
H  -0.380829 0.285676 -1.142499
H  3.396684 -2.537215 -0.65839
H  3.596153 0.987059 2.800511
H  4.69349 -2.902564 1.396491
H  4.797756 -1.133971 3.125874
H  -3.102029 -3.188179 -0.302507
H  -1.469885 -3.841382 -0.292968
H  -2.140198 -3.139771 1.182729
H  -1.407083 3.123299 -0.408925
H  -2.312706 2.911445 -1.895538
H  -3.097156 3.66351 -0.497221
H  2.981416 4.727548 0.368809
H  1.489022 4.063416 -0.325866
H  1.634701 4.279778 1.436799
H  -6.906427 -1.082198 2.028016
H  -5.2525 -1.635103 2.361695
H  -5.988887 -1.935806 0.770245
elementType: S O N C H
totalener: -1705.34328795 hartree
nucrepener: 2864.04066158 hartree
electener: -4569.38394954 hartree
oneelecener: -8031.71159055 hartree
twoeener: 3462.32764101 hartree
cpcmener: -0.04221620 hartree
kineticenergy: 1699.19594546 hartree
xcener: -140.061791866408 hartree
chargesum: 0.0000000
charge: 0.883710 -0.492193 -0.514085 -0.262911 -0.468961 -0.430795 -0.271089 -0.213275 -0.104978 -0.409469 -0.431182 -0.365013 -0.120417 0.072146 -0.021507 -0.189175 0.395765 -0.162633 -0.110536 0.441577 0.405045 -0.163938 0.318531 0.452107 -0.241404 -0.130517 -0.116167 0.216008 0.147582 0.149584 0.164122 0.163780 0.114235 0.119964 0.123806 0.097904 0.112907 0.100902 0.134468 0.119719 0.121134 0.132402 0.116276 0.116571
qa: 0.8837 -0.4922 -0.5141 -0.2629 -0.4690 -0.4308 -0.2711 -0.2133 -0.1050 -0.4095 -0.4312 -0.3650 -0.1204 0.0721 -0.0215 -0.1892 0.3958 -0.1626 -0.1105 0.4416 0.4050 -0.1639 0.3185 0.4521 -0.2414 -0.1305 -0.1162 0.2160 0.1476 0.1496 0.1641 0.1638 0.1142 0.1200 0.1238 0.0979 0.1129 0.1009 0.1345 0.1197 0.1211 0.1324 0.1163 0.1166
va: 5.8144 2.0108 1.9740 2.1391 2.0462 2.0673 2.1340 3.0871 3.2402 3.0150 2.9388 3.0173 3.7861 3.7138 3.8552 4.0228 4.3171 3.9508 3.9004 4.1015 4.1314 3.8552 3.9396 4.2524 3.9310 3.8599 3.8503 1.0759 1.0224 1.0043 0.9884 0.9871 0.9995 1.0172 0.9955 1.0099 1.0010 1.0198 0.9941 0.9902 0.9928 0.9948 0.9949 0.9935
dispcorr: -0.024074625 hartree
energy: -1705.367362577778
dipole: -8.92680 8.16115 -0.76564 2.94246 -2.81479 0.12767 9.41504 -6.79882 2.61622
magnitude: 2.72894 au
magnitude: 6.93641 debye
