program: Orca
programVersion: 5.0.2
elementType: S O O O O O O N N N N N C C C C C C C C C C C C C C C H H H H H H H H H H H H H H H H H
charge: 0
multiplicity: 1
keywords: wb97x-d3
keywords: def2-TZVPP
keywords: def2/J RIJCOSX
keywords: DEFGRID2
keywords: scfconv7
keywords: smallprint printgap noloewdin
keywords: NOSOSCF
formula: C15H17N5O6S
InChI: InChI=1S/C15H17N5O6S/c1-9-16-13(18-14(17-9)26-4)20(2)15(22)19-27(23,24)11-8-6-5-7-10(11)12(21)25-3/h5-8,19H,1-4H3
44 atoms
S  1.543434 -0.03354 1.59589
O  1.509106 1.417854 1.645282
O  1.880222 -0.78588 2.784987
O  2.534234 2.487755 -1.403527
O  0.463783 -2.645342 0.874466
O  0.658951 1.274114 -1.309368
O  -3.143093 2.41707 0.378972
N  0.017377 -0.450683 1.086545
N  -1.613831 -1.93597 0.268749
N  -3.624573 -1.356125 -0.678781
N  -2.323209 0.296147 0.344085
N  -4.389025 0.866757 -0.615397
C  2.643711 -0.524365 0.293254
C  2.758164 0.238076 -0.870309
C  3.464992 -1.618117 0.515879
C  3.712436 -0.124107 -1.811228
C  -0.322325 -1.730981 0.759168
C  4.399225 -1.977435 -0.443299
C  4.520272 -1.233218 -1.604244
C  1.852822 1.382183 -1.19504
C  -2.543015 -0.960661 -0.030145
C  -1.969089 -3.316653 -0.064238
C  -4.516125 -0.406741 -0.951876
C  -3.271753 1.160318 0.032376
C  -5.726983 -0.810995 -1.715597
C  1.797683 3.651183 -1.794516
C  -1.970162 2.826367 1.08441
H  -0.671236 0.300189 0.93278
H  3.390736 -2.188259 1.430617
H  3.818475 0.453494 -2.720155
H  5.034901 -2.835556 -0.273412
H  5.251244 -1.507662 -2.35293
H  -1.905445 -3.492515 -1.13689
H  -1.292237 -3.992704 0.443091
H  -2.979688 -3.52861 0.268869
H  -6.533025 -0.092402 -1.589114
H  -5.483801 -0.859217 -2.779825
H  -6.06533 -1.801605 -1.41724
H  1.269491 3.489744 -2.733978
H  1.087895 3.945877 -1.021529
H  2.534593 4.438324 -1.924828
H  -2.114929 3.880533 1.304854
H  -1.078864 2.709367 0.468417
H  -1.850352 2.278356 2.018993
elementType: S O N C H
totalener: -1705.34264496 hartree
nucrepener: 2890.47761750 hartree
electener: -4595.82026247 hartree
oneelecener: -8084.22933353 hartree
twoeener: 3488.40907107 hartree
cpcmener: -0.04104989 hartree
kineticenergy: 1699.18586076 hartree
xcener: -140.060707063423 hartree
chargesum: -0.0000000
charge: 0.886239 -0.517683 -0.495087 -0.266972 -0.470502 -0.435602 -0.269926 -0.202114 -0.101255 -0.426191 -0.422287 -0.366277 -0.131252 0.076643 -0.009893 -0.196407 0.388840 -0.163526 -0.106777 0.455168 0.409488 -0.162905 0.313564 0.448329 -0.244843 -0.127721 -0.112799 0.225634 0.148198 0.149193 0.164009 0.163623 0.122467 0.119371 0.113422 0.098608 0.113694 0.102969 0.120477 0.120332 0.132694 0.136792 0.098616 0.121649
qa: 0.8862 -0.5177 -0.4951 -0.2670 -0.4705 -0.4356 -0.2699 -0.2021 -0.1013 -0.4262 -0.4223 -0.3663 -0.1313 0.0766 -0.0099 -0.1964 0.3888 -0.1635 -0.1068 0.4552 0.4095 -0.1629 0.3136 0.4483 -0.2448 -0.1277 -0.1128 0.2256 0.1482 0.1492 0.1640 0.1636 0.1225 0.1194 0.1134 0.0986 0.1137 0.1030 0.1205 0.1203 0.1327 0.1368 0.0986 0.1216
va: 5.8095 1.9681 2.0070 2.1425 2.0487 2.0580 2.1434 3.1024 3.2399 2.9859 2.9593 3.0048 3.7990 3.6891 3.8405 4.0316 4.3271 3.9542 3.9037 4.0783 4.1277 3.8513 3.9772 4.2454 3.9299 3.8680 3.8500 1.0476 1.0215 1.0081 0.9884 0.9873 0.9969 1.0167 1.0034 1.0148 0.9999 1.0084 0.9926 0.9871 0.9944 0.9971 0.9970 0.9938
dispcorr: -0.024665591 hartree
energy: -1705.367310553906
dipole: -6.97419 7.17885 0.20466 1.60727 -1.34685 0.26042 -10.37966 7.97212 -2.40754
magnitude: 2.43022 au
magnitude: 6.17712 debye
