program: Orca
programVersion: 5.0.2
elementType: S O O O O O O N N N N N C C C C C C C C C C C C C C C H H H H H H H H H H H H H H H H H
charge: 0
multiplicity: 1
keywords: wb97x-d3
keywords: def2-TZVPP
keywords: def2/J RIJCOSX
keywords: DEFGRID2
keywords: scfconv7
keywords: smallprint printgap noloewdin
keywords: NOSOSCF
formula: C15H17N5O6S
InChI: InChI=1S/C15H17N5O6S/c1-9-16-13(18-14(17-9)26-4)20(2)15(22)19-27(23,24)11-8-6-5-7-10(11)12(21)25-3/h5-8,19H,1-4H3
44 atoms
S  1.56723 0.070605 1.657756
O  1.502298 1.517485 1.625624
O  1.970492 -0.625339 2.852711
O  2.427924 2.40797 -1.683105
O  0.491757 -2.615693 1.083599
O  0.575937 1.253783 -1.204864
O  -3.101072 2.421009 0.230132
N  0.031575 -0.409985 1.219155
N  -1.583697 -1.932748 0.4357
N  -3.565214 -1.413912 -0.599576
N  -2.298365 0.29968 0.367783
N  -4.321868 0.813508 -0.711283
C  2.614554 -0.475273 0.321012
C  2.706583 0.240346 -0.873878
C  3.426092 -1.572147 0.557991
C  3.643691 -0.161106 -1.817537
C  -0.28504 -1.706643 0.934138
C  4.334987 -1.976454 -0.407341
C  4.446851 -1.268217 -1.590627
C  1.772333 1.347529 -1.238692
C  -2.502432 -0.979381 0.057861
C  -1.931436 -3.32629 0.163031
C  -4.439972 -0.478414 -0.960354
C  -3.228154 1.144856 -0.040043
C  -5.65222 -0.940121 -1.69599
C  1.638797 3.508824 -2.120611
C  -1.952646 2.857848 0.947867
H  -0.643486 0.321213 0.971107
H  3.348876 -2.106365 1.493217
H  3.738501 0.387197 -2.744894
H  4.959535 -2.840191 -0.225652
H  5.162437 -1.572734 -2.342528
H  -1.897612 -3.538277 -0.904374
H  -1.225108 -3.967652 0.674751
H  -2.935203 -3.53235 0.521211
H  -5.376526 -1.643528 -2.480037
H  -6.316597 -1.470422 -1.011485
H  -6.191715 -0.099249 -2.122057
H  0.983443 3.2310 -2.94633
H  1.03213 3.90733 -1.307429
H  2.342905 4.266683 -2.451637
H  -1.883126 2.384299 1.928055
H  -2.080742 3.928733 1.077961
H  -1.034797 2.666215 0.392461
totalener: -1705.31206519 hartree
nucrepener: 2897.10145145 hartree
electener: -4602.41351663 hartree
oneelecener: -8096.51674580 hartree
twoeener: 3494.10322916 hartree
kineticenergy: 1699.24878673 hartree
xcener: -140.063506831598 hartree
chargesum: 0.0000000
charge: 0.871593 -0.477403 -0.434984 -0.256625 -0.396575 -0.386149 -0.234516 -0.204402 -0.124898 -0.397573 -0.414451 -0.302873 -0.192650 0.093005 0.039742 -0.185105 0.358962 -0.140667 -0.092045 0.420821 0.383653 -0.156492 0.254790 0.421456 -0.232689 -0.131330 -0.124859 0.200779 0.137624 0.121311 0.134174 0.132556 0.107044 0.124590 0.106222 0.097331 0.095207 0.104528 0.111742 0.111224 0.123173 0.114115 0.124377 0.096266
qa: 0.8716 -0.4774 -0.4350 -0.2566 -0.3966 -0.3861 -0.2345 -0.2044 -0.1249 -0.3976 -0.4145 -0.3029 -0.1927 0.0930 0.0397 -0.1851 0.3590 -0.1407 -0.0920 0.4208 0.3837 -0.1565 0.2548 0.4215 -0.2327 -0.1313 -0.1249 0.2008 0.1376 0.1213 0.1342 0.1326 0.1070 0.1246 0.1062 0.0973 0.0952 0.1045 0.1117 0.1112 0.1232 0.1141 0.1244 0.0963
va: 5.8336 2.0145 2.0759 2.1402 2.1183 2.1056 2.1710 3.1169 3.2307 2.9855 2.9701 3.0247 3.9467 3.6750 3.8559 4.0717 4.3281 3.9762 3.9439 4.1109 4.1387 3.8599 4.0352 4.2487 3.9077 3.8978 3.8781 1.0708 1.0287 1.0208 0.9990 0.9984 1.0016 1.0186 1.0047 1.0089 1.0053 1.0171 0.9942 0.9909 0.9951 0.9965 0.9981 0.9987
dispcorr: -0.024810962 hartree
energy: -1705.336876148892
dipole: -7.36270 7.45981 0.09712 0.76166 -0.68171 0.07995 -10.96255 9.13609 -1.82646
magnitude: 1.83079 au
magnitude: 4.65349 debye
