program: Gaussian 09
title: 000069161
version: EM64L-G09RevD.01
frameworkgroup: C1[X(C9H9NO4)]
method: RPBEPBE
basis: SDD
operation: Freq
keyword: #pfreq=noraman
keyword: PBEPBE/SDD
title: #p freq=noraman PBEPBE/SDD
converged: YES YES NO NO
title: Mulliken charges:
elementType: O O O O N C C C C C C C C C H H H H H H H H H
charge: -0.441565 -0.410112 -0.309076 -0.215839 -0.431867 0.319345 0.084621 -0.346161 -0.435453 -0.301548 -0.224574 -0.258640 0.136828 0.161217 0.407441 0.240262 0.259309 0.259283 0.273528 0.225864 0.232530 0.383597 0.391013
chargesum: 0.00000
title: Mulliken charges with hydrogens summed into heavy atoms:
elementType: O O O O N C C C C C C C C C
charge: -0.057968 -0.019099 -0.309076 -0.215839 -0.024426 0.319345 0.084621 -0.105900 0.083138 -0.028020 0.001289 -0.026111 0.136828 0.161217
polarizability: 1.63543157e+02 2.51659066e+00 1.48716704e+02 3.86522349e-02 1.39785013e-02 5.16739978e+01
1716.lowfreq: -8.8395 0.0006 0.0009 0.0009 5.9372 7.2207 45.7299 48.1831 86.6147
frequency: 45.7274 48.1714 86.6145 92.8422 140.9019 158.1493 213.6142 224.4443 256.7163 309.2173 386.2905 424.8913 466.7638 509.2171 525.2410 545.2663 548.1917 571.4562 606.5729 618.9381 630.3963 682.7000 737.2827 754.5378 763.9444 803.1071 841.0300 852.8436 894.5985 965.2982 986.7759 1001.8567 1003.3358 1043.6883 1051.1812 1104.9131 1154.6637 1173.2351 1178.7687 1213.9055 1250.8962 1265.8431 1316.8670 1343.0281 1367.5378 1401.8006 1441.1181 1450.0206 1467.7304 1521.4754 1583.1729 1597.6343 1639.4663 1683.3336 2941.8887 2977.2795 3130.9569 3155.0696 3165.5726 3180.6333 3324.5860 3526.9379 3534.8106
redmass: 9.7187 6.0437 7.6890 6.3579 4.7487 2.8380 7.3040 6.7997 4.4536 7.4492 9.0071 3.0704 6.1027 1.8054 2.9230 5.2773 5.0873 1.1989 5.1305 5.8311 1.4499 3.9539 5.4399 2.3832 1.4169 1.3237 5.9080 1.5436 3.6300 1.3650 1.3347 5.4495 1.9111 2.3696 2.6101 2.0650 2.1830 1.7591 1.1402 1.0780 1.5727 1.5806 1.8555 2.1764 2.5718 4.1946 1.9937 2.5858 1.1705 3.4250 5.5536 3.8198 6.5500 8.3755 1.0583 1.0997 1.0866 1.0894 1.0944 1.0985 1.0803 1.0642 1.0641
irintensity: 0.5210 0.8322 1.0365 0.7001 0.3553 7.9553 5.0067 2.3387 0.0051 1.3776 8.6870 12.2965 53.4217 30.6368 14.2416 22.2425 10.4960 127.8298 34.7797 11.5763 117.7065 48.3633 1.3392 4.0766 125.1409 83.9637 0.8751 1.5432 3.3786 2.3857 0.0005 257.1960 1.5233 58.9329 411.8010 47.7583 129.6033 29.1713 1.0655 0.1021 47.7507 16.1100 80.3373 69.7097 43.6958 4.0874 24.8735 2.1730 65.7253 208.4136 195.6026 77.9218 341.8015 171.3920 74.5975 16.4431 8.1904 16.0097 16.2275 10.3926 130.0994 40.3586 55.1715
temp: 298.150 k
press: 1.00000 atm
elementType: 8 8 8 8 7 6 6 6 6 6 6 6 6 6 1 1 1 1 1 1 1 1 1
symmnumber: 1
zpe: 447911.5 jmol-1
zpe.correction: 0.170600 hartree
zpe.thermalcorrener: 0.183228 hartree
zpe.thermalcorrenthalpy: 0.184172 hartree
zpe.thermalcorrgfe: 0.130515 hartree
zpe.sumelectzpe: -703.012665 hartree
zpe.sumelectthermal: -703.000037 hartree
zpe.sumelectthermalent: -702.999093 hartree
zpe.sumelectthermalfe: -703.052751 hartree
dipole: 1.0341 -2.4159 -0.0017
dipole: 2.6279
quadrupole: -65.3694 -76.7454 -83.3665
quadrupole: -5.6004 -0.0055 -0.0504
quadrupole: 9.7910 -1.5850 -8.2060 -5.6004 -0.0055 -0.0504
hfenergy: -703.1832656 hartree
pointgroup: C01 [X(C9H9N1O4)]
dipole: 0.376355 0.962604 -0.0260567 debye
dipolederiv: -0.9507744 -0.7473368 0.0230043 -0.5854056 -0.8452925 0.0138027 0.0188308 0.0147275 -0.4281126 -1.2374233 -0.474764 0.0095619 -0.4608812 -0.5024962 0.0008282 0.00925 0.0015186 -0.4266189 -0.8232102 0.2969192 -0.0059103 0.1675371 -0.9683351 0.0163265 -0.0023579 0.0167194 -0.3434782 -0.7545114 0.1035511 -0.0030329 -0.1191168 -0.8942889 0.0146506 0.001724 0.0137618 -0.2952443 -1.5555113 -0.0116572 0.0016597 0.425083 -0.3520194 -0.0009316 -0.0145179 -0.0016378 -0.4170899 1.3749224 -0.0569237 0.000986 -0.7919103 0.2177598 -0.0013547 0.0214594 -0.0023512 0.1543742 -0.3674799 0.3583944 -0.0095035 -0.3038833 -0.9717329 0.0253824 0.0087098 0.024693 -0.0687887 -0.3725472 -0.0201658 0.0004965 0.6556972 -0.0692774 -0.0056805 -0.0176828 -0.0047607 -0.24741 0.4538089 0.2605126 -0.0091566 0.7121183 0.0575229 0.0074364 -0.0227288 0.0087769 0.3559726 0.040902 -0.4367423 0.0120783 0.1060279 0.4800864 -0.015931 -0.0030272 -0.0145964 -0.0871326 0.4776278 0.3040952 -0.0090525 0.0024295 0.2367806 -0.0096527 -0.0006694 -0.0101543 -0.1066252 -0.1398613 -0.1897974 0.0050337 -0.2615626 -0.5768679 0.0101204 0.0069957 0.0102727 -0.225386 1.2761027 0.1770266 -0.0102571 0.3598569 2.1092814 -0.053188 -0.015336 -0.0537702 0.2310187 1.7427097 0.1769242 -0.0007433 0.2337493 1.28512 -0.0260343 -0.0006892 -0.0261124 0.198842 0.331006 0.0327449 -0.0008964 0.0025502 0.3344682 -0.0009833 0.001343 -0.0011056 0.3109765 -0.0525052 -0.1078466 0.0033838 -0.091411 0.0287697 0.0040864 0.0028173 0.004073 0.1697768 -0.0157182 0.0030934 -0.0047087 -0.171125 0.0016193 -0.0802881 -0.0694882 -0.0940736 -0.0215462 -0.0178712 0.0034128 0.0049333 -0.1677611 0.0115167 0.0784982 0.0814606 0.0920707 -0.032455 0.0243761 -0.0553416 0.0016942 -0.0736756 0.0795654 0.0021421 0.0023128 0.0019815 0.154742 0.0936983 0.0248655 -0.0006343 0.0388367 -0.1249971 0.0076369 -0.0011148 0.0076665 0.1484008 -0.095816 0.0796043 -0.001832 0.0684537 0.0457466 0.0035129 -0.0015035 0.0033516 0.1754116 0.2798135 0.1857534 -0.0047255 0.1121749 0.2421777 0.0039991 -0.0027545 0.0034767 0.3960436 0.2882622 0.0936777 -0.0023786 0.1422177 0.1748924 0.0056215 -0.003033 0.0054722 0.4043286 unknown
polarizability: 163.6882474|-2.041792|148.4989186|-0.0560265|-2.6512857|51.7466928 unknown
InChI: InChI=1S/C9H9NO4/c11-8(12)5-10-7-4-2-1-3-6(7)9(13)14/h1-4,10-11,13H,5H2
charge 0 multiplicity 1
23 atoms
O  -2.533203 -2.535836 0.110291
O  4.497282 0.792995 0.015704
O  -0.221826 -2.424499 0.097033
O  3.402738 -1.261576 0.062051
N  0.922005 0.005406 0.032469
C  -0.359785 0.519057 0.018957
C  -1.515062 -0.354121 0.044677
C  -0.592554 1.932489 -0.020193
C  2.106164 0.844253 0.007498
C  -2.823939 0.203791 0.030964
C  -1.897033 2.449812 -0.032825
C  -3.027928 1.591453 -0.007505
C  -1.332267 -1.808173 0.084662
C  3.358402 -0.016183 0.033539
H  1.027244 -1.023902 0.057284
H  0.254934 2.623779 -0.040836
H  2.154703 1.53742 0.874499
H  2.155332 1.483523 -0.900364
H  -3.672144 -0.486159 0.051359
H  -2.038581 3.536473 -0.063175
H  -4.040589 2.005184 -0.017546
H  -2.303541 -3.502916 0.136925
H  5.312951 0.223029 0.029829
