program: Orca
programVersion: 4.2.1
elementType: S S O O O O O O N N N N N C C C C C C C C C C C C H H H H H H H H H H H H H
charge: 0
multiplicity: 1
keywords: wb97x-d3
keywords: def2-TZVPP
keywords: def2/J RIJCOSX GRIDX6 NOFINALGRIDX
keywords: grid4 nofinalgrid
keywords: scfconv7
keywords: smallprint printgap noloewdin
keywords: NOSOSCF
formula: C12H13N5O6S2
InChI: InChI=1S/C12H13N5O6S2/c1-6-13-10(16-12(14-6)23-3)15-11(19)17-25(20,21)7-4-5-24-8(7)9(18)22-2/h4-5,15,17H,1-3H3
38 atoms
S  -1.731262 -0.351503 -1.960927
S  -3.734956 1.301179 1.434033
O  -2.395575 -1.484276 -2.570251
O  -1.372835 0.78293 -2.784804
O  -1.315113 2.70234 1.551791
O  -1.273728 -2.382399 0.102311
O  -0.260647 1.850592 -0.233445
O  5.181106 -1.122752 1.757271
N  -0.307131 -0.856669 -1.272498
N  0.90808 -1.90177 0.412985
N  2.2386 -0.397286 -0.761283
N  3.038586 -1.553458 1.123031
N  4.434765 -0.03831 -0.028481
C  -2.742731 0.156361 -0.604368
C  -2.440423 1.118305 0.330384
C  -4.018021 -0.422983 -0.423199
C  -4.665044 0.116992 0.647461
C  -0.295495 -1.754597 -0.241756
C  -1.217929 1.916669 0.494708
C  2.099562 -1.250471 0.237744
C  3.433959 0.190825 -0.855091
C  4.176823 -0.915592 0.939571
C  3.631084 1.138147 -1.980387
C  -0.190035 3.52762 1.869145
C  5.01279 -2.030908 2.847454
H  -4.439004 -1.196733 -1.045189
H  0.545716 -0.299679 -1.433357
H  -5.649175 -0.137664 1.010076
H  3.670234 0.58219 -2.919167
H  2.792546 1.829447 -2.052997
H  4.555127 1.698294 -1.872614
H  0.688834 2.923305 2.089813
H  0.033181 4.219274 1.058262
H  -0.474958 4.08758 2.754021
H  4.22299 -1.701434 3.520772
H  5.96097 -2.029555 3.376467
H  4.796459 -3.038869 2.496798
H  0.880826 -2.558087 1.183177
elementType: S O N C H
totalener: -1986.80272804 hartree
nucrepener: 2711.36148568 hartree
electener: -4698.16421372 hartree
oneelecener: -8120.56068671 hartree
twoeener: 3422.39647298 hartree
cpcmener: -0.05216632 hartree
kineticenergy: 1980.59787395 hartree
xcener: -147.028728118404 hartree
chargesum: -0.0000000
charge: 0.896276 0.128347 -0.509578 -0.507363 -0.277170 -0.467108 -0.438194 -0.280155 -0.202631 -0.127964 -0.405495 -0.413098 -0.368616 -0.181181 0.007920 -0.104147 -0.146273 0.362212 0.511534 0.392975 0.322310 0.467556 -0.244577 -0.126600 -0.115059 0.166384 0.216831 0.177068 0.117146 0.103992 0.099146 0.122140 0.122432 0.131647 0.118866 0.133411 0.118859 0.198158
qa: 0.8963 0.1283 -0.5096 -0.5074 -0.2772 -0.4671 -0.4382 -0.2802 -0.2026 -0.1280 -0.4055 -0.4131 -0.3686 -0.1812 0.0079 -0.1041 -0.1463 0.3622 0.5115 0.3930 0.3223 0.4676 -0.2446 -0.1266 -0.1151 0.1664 0.2168 0.1771 0.1171 0.1040 0.0991 0.1221 0.1224 0.1316 0.1189 0.1334 0.1189 0.1982
va: 5.8271 2.8718 1.9890 1.9796 2.1331 2.0415 2.0509 2.1249 3.0799 3.2142 3.0045 2.9604 3.0151 3.8616 3.6962 3.9656 4.0219 4.4137 4.0229 4.2142 3.9308 4.2284 3.9330 3.8579 3.8422 1.0058 1.0683 0.9891 0.9990 1.0066 1.0181 0.9913 0.9922 0.9946 0.9948 0.9943 0.9947 1.0129
dispcorr: -0.019812464 hartree
energy: -1986.822540504803
dipole: 16.77306 -15.90033 0.87274 4.20415 -3.38672 0.81742 8.01111 -4.41571 3.59540
magnitude: 3.78903 au
magnitude: 9.63094 debye
