program: Orca
programVersion: 4.2.1
elementType: S S O O O O O O N N N N N C C C C C C C C C C C C H H H H H H H H H H H H H
charge: 0
multiplicity: 1
keywords: wb97x-d3
keywords: def2-TZVPP
keywords: def2/J RIJCOSX GRIDX6 NOFINALGRIDX
keywords: grid4 nofinalgrid
keywords: scfconv7
keywords: smallprint printgap noloewdin
keywords: NOSOSCF
formula: C12H13N5O6S2
InChI: InChI=1S/C12H13N5O6S2/c1-6-13-10(16-12(14-6)23-3)15-11(19)17-25(20,21)7-4-5-24-8(7)9(18)22-2/h4-5,15,17H,1-3H3
38 atoms
S  -1.74229 -0.362453 -2.003756
S  -3.664419 1.26989 1.448872
O  -2.432176 -1.479462 -2.613593
O  -1.37024 0.76778 -2.827175
O  -1.174335 2.541958 1.61216
O  -1.298216 -2.417949 0.046737
O  -0.217157 1.80708 -0.276739
O  5.081373 -0.973625 1.847211
N  -0.322474 -0.894447 -1.326039
N  0.869768 -1.901268 0.39869
N  2.201615 -0.402335 -0.778241
N  2.968841 -1.476771 1.166318
N  4.361074 0.04159 0.011884
C  -2.731149 0.155392 -0.633684
C  -2.387267 1.077667 0.326379
C  -4.023652 -0.385945 -0.456829
C  -4.642695 0.144188 0.63499
C  -0.321895 -1.781141 -0.284076
C  -1.139432 1.834795 0.497428
C  2.051027 -1.226286 0.242994
C  3.381343 0.218858 -0.85135
C  4.096616 -0.815963 0.996458
C  3.580441 1.144115 -1.994047
C  -0.019616 3.321774 1.937546
C  4.907771 -1.852153 2.96012
H  -4.475145 -1.12715 -1.096817
H  0.534068 -0.338126 -1.476426
H  -5.632182 -0.086331 0.999129
H  3.637807 0.569945 -2.920654
H  2.731279 1.820031 -2.088345
H  4.494512 1.720327 -1.887094
H  0.169338 4.0811 1.180497
H  -0.245283 3.802735 2.883809
H  0.859871 2.689954 2.052717
H  5.844696 -1.815861 3.507536
H  4.71784 -2.87407 2.63612
H  4.098479 -1.517951 3.607666
H  0.836126 -2.54477 1.179379
elementType: S O N C H
totalener: -1986.80204185 hartree
nucrepener: 2724.06854812 hartree
electener: -4710.87058996 hartree
oneelecener: -8145.88643407 hartree
twoeener: 3435.01584410 hartree
cpcmener: -0.05225781 hartree
kineticenergy: 1980.60259011 hartree
xcener: -147.029414049110 hartree
chargesum: 0.0000000
charge: 0.896889 0.128805 -0.509324 -0.507092 -0.276925 -0.463679 -0.434746 -0.278990 -0.206343 -0.126795 -0.400347 -0.411372 -0.367182 -0.185891 0.014973 -0.104040 -0.146392 0.356124 0.505876 0.385539 0.319843 0.468756 -0.243204 -0.125681 -0.115147 0.166109 0.217204 0.177133 0.116839 0.104175 0.099076 0.123179 0.131837 0.120669 0.133306 0.118963 0.119345 0.198509
qa: 0.8969 0.1288 -0.5093 -0.5071 -0.2769 -0.4637 -0.4347 -0.2790 -0.2063 -0.1268 -0.4003 -0.4114 -0.3672 -0.1859 0.0150 -0.1040 -0.1464 0.3561 0.5059 0.3855 0.3198 0.4688 -0.2432 -0.1257 -0.1151 0.1661 0.2172 0.1771 0.1168 0.1042 0.0991 0.1232 0.1318 0.1207 0.1333 0.1190 0.1193 0.1985
va: 5.8259 2.8719 1.9888 1.9791 2.1334 2.0440 2.0548 2.1262 3.0733 3.2142 3.0037 2.9602 3.0154 3.8654 3.6821 3.9677 4.0228 4.4169 4.0294 4.2187 3.9314 4.2254 3.9331 3.8596 3.8421 1.0057 1.0704 0.9891 0.9992 1.0065 1.0183 0.9922 0.9947 0.9907 0.9944 0.9946 0.9946 1.0125
dispcorr: -0.020206060 hartree
energy: -1986.822247906637
dipole: 16.80200 -15.85640 0.94560 4.23219 -3.43180 0.80039 8.38712 -4.68715 3.69998
magnitude: 3.90187 au
magnitude: 9.91777 debye
