program: Orca
programVersion: 4.2.1
elementType: S S O O O O O O N N N N N C C C C C C C C C C C C H H H H H H H H H H H H H
charge: 0
multiplicity: 1
keywords: wb97x-d3
keywords: def2-TZVPP
keywords: def2/J RIJCOSX GRIDX6 NOFINALGRIDX
keywords: grid4 nofinalgrid
keywords: scfconv7
keywords: smallprint printgap noloewdin
keywords: NOSOSCF
formula: C12H13N5O6S2
InChI: InChI=1S/C12H13N5O6S2/c1-6-13-10(16-12(14-6)23-3)15-11(19)17-25(20,21)7-4-5-24-8(7)9(18)22-2/h4-5,15,17H,1-3H3
38 atoms
S  -1.752155 -0.371348 -2.013518
S  -3.630043 1.262806 1.463408
O  -2.460755 -1.476873 -2.623082
O  -1.377246 0.762772 -2.830718
O  -1.120182 2.489853 1.631169
O  -1.308655 -2.417737 0.044105
O  -0.169298 1.737038 -0.253588
O  5.028651 -0.878594 1.889618
N  -0.329779 -0.924289 -1.358283
N  0.864195 -1.909899 0.378083
N  2.202326 -0.431073 -0.818477
N  2.939116 -1.431497 1.177006
N  4.331753 0.078385 0.012984
C  -2.722637 0.148383 -0.630872
C  -2.359762 1.057121 0.335607
C  -4.023882 -0.371369 -0.454454
C  -4.629506 0.159586 0.644742
C  -0.328871 -1.793912 -0.302017
C  -1.096621 1.786847 0.513778
C  2.039555 -1.222862 0.225577
C  3.370613 0.21309 -0.879038
C  4.060696 -0.758548 1.013744
C  3.577564 1.117671 -2.036869
C  0.054673 3.233842 1.971189
C  4.84318 -1.733086 3.020188
H  -4.491362 -1.098591 -1.099027
H  0.529077 -0.377149 -1.525351
H  -5.621642 -0.057529 1.010209
H  4.49723 1.686785 -1.939963
H  3.62417 0.530797 -2.955671
H  2.736452 1.803375 -2.138116
H  0.276064 3.987812 1.217418
H  -0.16758 3.7204 2.915612
H  0.912719 2.574735 2.096391
H  4.680657 -2.766131 2.716992
H  4.012207 -1.397986 3.638961
H  5.76565 -1.665795 3.589147
H  0.825523 -2.533072 1.17505
elementType: S O N C H
totalener: -1986.80185123 hartree
nucrepener: 2729.80384101 hartree
electener: -4716.60569224 hartree
oneelecener: -8157.35933134 hartree
twoeener: 3440.75363910 hartree
cpcmener: -0.05201251 hartree
kineticenergy: 1980.59415195 hartree
xcener: -147.027566787812 hartree
chargesum: -0.0000000
charge: 0.897333 0.129052 -0.509382 -0.507662 -0.276550 -0.463493 -0.436475 -0.278854 -0.204213 -0.127522 -0.400167 -0.409760 -0.365855 -0.186779 0.018775 -0.105341 -0.146595 0.352857 0.506197 0.381257 0.319510 0.467189 -0.241683 -0.125963 -0.115017 0.166249 0.219118 0.177217 0.098803 0.115957 0.104997 0.123348 0.132118 0.120547 0.119346 0.119462 0.133223 0.198756
qa: 0.8973 0.1291 -0.5094 -0.5077 -0.2766 -0.4635 -0.4365 -0.2789 -0.2042 -0.1275 -0.4002 -0.4098 -0.3659 -0.1868 0.0188 -0.1053 -0.1466 0.3529 0.5062 0.3813 0.3195 0.4672 -0.2417 -0.1260 -0.1150 0.1662 0.2191 0.1772 0.0988 0.1160 0.1050 0.1233 0.1321 0.1205 0.1193 0.1195 0.1332 0.1988
va: 5.8239 2.8724 1.9885 1.9788 2.1341 2.0432 2.0532 2.1269 3.0734 3.2127 3.0008 2.9572 3.0152 3.8663 3.6796 3.9697 4.0229 4.4209 4.0279 4.2204 3.9331 4.2251 3.9315 3.8600 3.8417 1.0056 1.0677 0.9890 1.0187 0.9997 1.0060 0.9922 0.9947 0.9906 0.9946 0.9946 0.9944 1.0123
dispcorr: -0.020380007 hartree
energy: -1986.822231239493
dipole: 16.80028 -15.83754 0.96275 4.28141 -3.47013 0.81129 8.47902 -4.78503 3.69399
magnitude: 3.90265 au
magnitude: 9.91974 debye
