program: Orca
programVersion: 4.2.1
elementType: S S O O O O O O N N N N N C C C C C C C C C C C C H H H H H H H H H H H H H
charge: 0
multiplicity: 1
keywords: wb97x-d3
keywords: def2-TZVPP
keywords: def2/J RIJCOSX GRIDX6 NOFINALGRIDX
keywords: grid4 nofinalgrid
keywords: scfconv7
keywords: smallprint printgap noloewdin
keywords: NOSOSCF
formula: C12H13N5O6S2
InChI: InChI=1S/C12H13N5O6S2/c1-6-13-10(16-12(14-6)23-3)15-11(19)17-25(20,21)7-4-5-24-8(7)9(18)22-2/h4-5,15,17H,1-3H3
38 atoms
S  -1.688088 -1.734493 0.020395
S  -3.615266 2.067725 0.331656
O  -1.421731 -2.131135 1.386228
O  -2.328476 -2.674689 -0.874597
O  -1.337443 2.519787 1.911785
O  -1.014366 -0.573479 -2.59036
O  -0.269141 0.569858 1.636857
O  3.58013 -1.125021 1.671804
N  -0.207162 -1.309739 -0.601365
N  1.154642 -0.177072 -2.112757
N  3.300025 0.558168 -1.89715
N  2.317488 -0.699978 -0.17211
N  4.523803 0.075597 0.054399
C  -2.650895 -0.253961 -0.028456
C  -2.374187 0.926722 0.620228
C  -3.86323 -0.226742 -0.752891
C  -4.488473 0.978001 -0.636336
C  -0.090905 -0.6870 -1.814175
C  -1.210568 1.294429 1.437604
C  2.295067 -0.109575 -1.357827
C  4.396532 0.625047 -1.145636
C  3.45558 -0.574868 0.488562
C  5.564923 1.348337 -1.70745
C  -0.25835 3.035106 2.699011
C  2.471024 -1.83481 2.229146
H  -4.25634 -1.048852 -1.329375
H  0.593436 -1.263538 0.0421
H  -5.425939 1.270978 -1.083793
H  6.112187 0.679665 -2.37573
H  5.249362 2.207373 -2.295446
H  6.246639 1.67014 -0.924843
H  -0.559363 4.03526 2.993307
H  -0.094178 2.428579 3.588497
H  0.659906 3.088904 2.115524
H  2.166091 -2.664985 1.592637
H  1.627708 -1.169014 2.407252
H  2.823002 -2.226043 3.178975
H  1.206801 0.283698 -3.012594
elementType: S O N C H
totalener: -1986.80265908 hartree
nucrepener: 2743.33460341 hartree
electener: -4730.13726249 hartree
oneelecener: -8184.12399937 hartree
twoeener: 3453.98673689 hartree
cpcmener: -0.04859239 hartree
kineticenergy: 1980.59677424 hartree
xcener: -147.028920024871 hartree
chargesum: -0.0000000
charge: 0.894999 0.130089 -0.504106 -0.508417 -0.277182 -0.464595 -0.445768 -0.276912 -0.204121 -0.127155 -0.406142 -0.412772 -0.369759 -0.177609 -0.001905 -0.101278 -0.145867 0.362479 0.525428 0.392702 0.325876 0.453724 -0.240066 -0.125758 -0.134317 0.165902 0.225621 0.177030 0.117800 0.102801 0.098084 0.131805 0.121314 0.122931 0.120560 0.118397 0.139643 0.196544
qa: 0.8950 0.1301 -0.5041 -0.5084 -0.2772 -0.4646 -0.4458 -0.2769 -0.2041 -0.1272 -0.4061 -0.4128 -0.3698 -0.1776 -0.0019 -0.1013 -0.1459 0.3625 0.5254 0.3927 0.3259 0.4537 -0.2401 -0.1258 -0.1343 0.1659 0.2256 0.1770 0.1178 0.1028 0.0981 0.1318 0.1213 0.1229 0.1206 0.1184 0.1396 0.1965
va: 5.8282 2.8727 1.9832 1.9901 2.1361 2.0457 2.0452 2.1340 3.0921 3.2132 3.0162 2.9491 3.0060 3.8550 3.7090 3.9634 4.0197 4.4158 4.0001 4.2306 3.9571 4.2312 3.9324 3.8563 3.8433 1.0066 1.0468 0.9891 0.9987 1.0098 1.0148 0.9948 0.9925 0.9920 0.9905 0.9994 0.9976 1.0154
dispcorr: -0.020925860 hartree
energy: -1986.823584936352
dipole: 15.63473 -15.09805 0.53668 6.90085 -3.81958 3.08126 4.58411 -4.20457 0.37953
magnitude: 3.15060 au
magnitude: 8.00818 debye
