program: Orca
programVersion: 4.2.1
elementType: S S O O O O O O N N N N N C C C C C C C C C C C C H H H H H H H H H H H H H
charge: 0
multiplicity: 1
keywords: wb97x-d3
keywords: def2-TZVPP
keywords: def2/J RIJCOSX GRIDX6 NOFINALGRIDX
keywords: grid4 nofinalgrid
keywords: scfconv7
keywords: smallprint printgap noloewdin
keywords: NOSOSCF
formula: C12H13N5O6S2
InChI: InChI=1S/C12H13N5O6S2/c1-6-13-10(16-12(14-6)23-3)15-11(19)17-25(20,21)7-4-5-24-8(7)9(18)22-2/h4-5,15,17H,1-3H3
38 atoms
S  -1.727415 -1.770985 -0.055265
S  -3.51869 2.109511 0.079018
O  -2.357391 -2.76298 0.78941
O  -1.538987 -2.057561 -1.461271
O  -1.223321 2.669973 -1.430928
O  -0.894149 -0.810389 2.593557
O  -0.26635 0.64548 -1.479077
O  3.403746 -1.030344 -1.997251
N  -0.204966 -1.444795 0.525853
N  1.234491 -0.356242 1.997316
N  3.307926 0.518122 1.641333
N  2.278429 -0.764012 -0.03755
N  4.396986 0.178798 -0.417052
C  -2.637168 -0.271317 0.161514
C  -2.324433 0.964284 -0.355718
C  -3.839853 -0.282747 0.901907
C  -4.422166 0.948784 0.928988
C  -0.019899 -0.875259 1.757248
C  -1.159482 1.382499 -1.14706
C  2.308091 -0.199213 1.160978
C  4.335771 0.677439 0.809325
C  3.341931 -0.532031 -0.786774
C  5.474415 1.499503 1.290142
C  -0.136184 3.236004 -2.170497
C  2.314266 -1.818758 -2.482062
H  -4.25664 -1.149796 1.389158
H  0.559411 -1.359203 -0.156775
H  -5.343861 1.222481 1.419126
H  5.174355 2.548836 1.320853
H  5.754267 1.217473 2.303854
H  6.336957 1.40856 0.63644
H  -0.383257 4.28413 -2.303536
H  0.798472 3.1507 -1.617901
H  -0.031531 2.760925 -3.144613
H  2.158359 -2.703874 -1.866468
H  2.600286 -2.127878 -3.482713
H  1.396466 -1.234894 -2.538328
H  1.334402 0.074174 2.908105
elementType: S O N C H
totalener: -1986.80183670 hartree
nucrepener: 2759.18998244 hartree
electener: -4745.99181914 hartree
oneelecener: -8215.80359476 hartree
twoeener: 3469.81177562 hartree
cpcmener: -0.04848047 hartree
kineticenergy: 1980.59875779 hartree
xcener: -147.028968206409 hartree
chargesum: 0.0000000
charge: 0.896959 0.130627 -0.507383 -0.504735 -0.276902 -0.461315 -0.445417 -0.275558 -0.204484 -0.126617 -0.407912 -0.408767 -0.365213 -0.180554 0.007272 -0.104173 -0.146059 0.353637 0.522321 0.382798 0.326629 0.454560 -0.236817 -0.125854 -0.130360 0.166131 0.223201 0.177575 0.114864 0.106445 0.096089 0.132860 0.121786 0.121241 0.124649 0.140122 0.111249 0.197103
qa: 0.8970 0.1306 -0.5074 -0.5047 -0.2769 -0.4613 -0.4454 -0.2756 -0.2045 -0.1266 -0.4079 -0.4088 -0.3652 -0.1806 0.0073 -0.1042 -0.1461 0.3536 0.5223 0.3828 0.3266 0.4546 -0.2368 -0.1259 -0.1304 0.1661 0.2232 0.1776 0.1149 0.1064 0.0961 0.1329 0.1218 0.1212 0.1246 0.1401 0.1112 0.1971
va: 5.8246 2.8735 1.9911 1.9817 2.1367 2.0471 2.0459 2.1355 3.0871 3.2117 3.0117 2.9491 3.0090 3.8575 3.6939 3.9686 4.0202 4.4219 4.0051 4.2396 3.9555 4.2254 3.9314 3.8584 3.8446 1.0060 1.0527 0.9890 1.0000 1.0063 1.0173 0.9946 0.9914 0.9930 0.9892 0.9975 0.9993 1.0150
dispcorr: -0.021382270 hartree
energy: -1986.823218972060
dipole: 15.42643 -14.81507 0.61136 7.64471 -4.48265 3.16206 -4.85895 4.72787 -0.13108
magnitude: 3.22328 au
magnitude: 8.19294 debye
