program: Orca
programVersion: 4.2.1
elementType: S S O O O O O O N N N N N C C C C C C C C C C C C H H H H H H H H H H H H H
charge: 0
multiplicity: 1
keywords: wb97x-d3
keywords: def2-TZVPP
keywords: def2/J RIJCOSX GRIDX6 NOFINALGRIDX
keywords: grid4 nofinalgrid
keywords: scfconv7
keywords: smallprint printgap noloewdin
keywords: NOSOSCF
formula: C12H13N5O6S2
InChI: InChI=1S/C12H13N5O6S2/c1-6-13-10(16-12(14-6)23-3)15-11(19)17-25(20,21)7-4-5-24-8(7)9(18)22-2/h4-5,15,17H,1-3H3
38 atoms
S  -1.706992 -1.743686 -0.014098
S  -3.622267 2.061855 0.351903
O  -1.45776 -2.193603 1.337906
O  -2.326291 -2.652059 -0.955048
O  -1.291695 2.514089 1.85494
O  -1.018249 -0.529602 -2.588139
O  -0.340883 0.489398 1.735644
O  3.605974 -1.128322 1.653113
N  -0.22116 -1.275983 -0.598807
N  1.143462 -0.122814 -2.095178
N  3.291432 0.600177 -1.890236
N  2.317952 -0.670071 -0.16701
N  4.533764 0.088322 0.040784
C  -2.67723 -0.266228 -0.023247
C  -2.390929 0.907486 0.633493
C  -3.889952 -0.224897 -0.746471
C  -4.507354 0.98277 -0.618278
C  -0.09939 -0.644149 -1.806661
C  -1.228788 1.255772 1.461138
C  2.289206 -0.069783 -1.347908
C  4.395696 0.654913 -1.149647
C  3.466733 -0.561926 0.479465
C  5.560035 1.38211 -1.71571
C  -0.221947 3.00163 2.671595
C  2.502042 -1.837044 2.220982
H  -4.28905 -1.039588 -1.329422
H  0.572996 -1.239982 0.05166
H  -5.444005 1.28571 -1.06063
H  6.085078 0.729056 -2.416431
H  5.240066 2.261542 -2.270494
H  6.261938 1.6742 -0.939364
H  -0.458465 4.040138 2.879349
H  -0.159059 2.44885 3.607838
H  0.730524 2.944397 2.146352
H  2.203589 -2.677957 1.595868
H  1.653127 -1.176394 2.389626
H  2.856817 -2.211358 3.176308
H  1.194296 0.346758 -2.990487
elementType: S O N C H
totalener: -1986.80274942 hartree
nucrepener: 2741.52656373 hartree
electener: -4728.32931315 hartree
oneelecener: -8180.44660448 hartree
twoeener: 3452.11729133 hartree
cpcmener: -0.04924932 hartree
kineticenergy: 1980.58773967 hartree
xcener: -147.027152014896 hartree
chargesum: -0.0000000
charge: 0.895389 0.130208 -0.503742 -0.506160 -0.276487 -0.464687 -0.446805 -0.276998 -0.208950 -0.127346 -0.407494 -0.416204 -0.370150 -0.175915 -0.002547 -0.101532 -0.145588 0.364996 0.524582 0.394842 0.324887 0.454417 -0.239646 -0.125630 -0.134552 0.165798 0.228421 0.176894 0.117546 0.103139 0.097698 0.131900 0.123135 0.121236 0.123284 0.116183 0.139505 0.196373
qa: 0.8954 0.1302 -0.5037 -0.5062 -0.2765 -0.4647 -0.4468 -0.2770 -0.2090 -0.1273 -0.4075 -0.4162 -0.3702 -0.1759 -0.0025 -0.1015 -0.1456 0.3650 0.5246 0.3948 0.3249 0.4544 -0.2396 -0.1256 -0.1346 0.1658 0.2284 0.1769 0.1175 0.1031 0.0977 0.1319 0.1231 0.1212 0.1233 0.1162 0.1395 0.1964
va: 5.8269 2.8710 1.9821 1.9926 2.1359 2.0452 2.0449 2.1336 3.0950 3.2141 3.0151 2.9464 3.0057 3.8604 3.7047 3.9630 4.0200 4.4124 4.0015 4.2268 3.9588 4.2299 3.9326 3.8565 3.8425 1.0062 1.0406 0.9892 0.9988 1.0093 1.0151 0.9947 0.9924 0.9920 0.9898 0.9998 0.9976 1.0158
dispcorr: -0.020837641 hartree
energy: -1986.823587062836
dipole: 15.79827 -15.24936 0.54891 6.94466 -3.82827 3.11640 4.58030 -4.17365 0.40665
magnitude: 3.19039 au
magnitude: 8.10933 debye
