program: Orca
programVersion: 4.2.1
elementType: S S O O O O O O N N N N N C C C C C C C C C C C C H H H H H H H H H H H H H
charge: 0
multiplicity: 1
keywords: wb97x-d3
keywords: def2-TZVPP
keywords: def2/J RIJCOSX GRIDX6 NOFINALGRIDX
keywords: grid4 nofinalgrid
keywords: scfconv7
keywords: smallprint printgap noloewdin
keywords: NOSOSCF
formula: C12H13N5O6S2
InChI: InChI=1S/C12H13N5O6S2/c1-6-13-10(16-12(14-6)23-3)15-11(19)17-25(20,21)7-4-5-24-8(7)9(18)22-2/h4-5,15,17H,1-3H3
38 atoms
S  -1.727597 -1.776461 -0.021165
S  -3.536101 2.098164 0.050244
O  -2.340777 -2.751327 0.855271
O  -1.544638 -2.101658 -1.419215
O  -1.225643 2.646785 -1.446207
O  -0.896169 -0.741448 2.597245
O  -0.309841 0.604325 -1.53525
O  3.416165 -1.054066 -1.979663
N  -0.205908 -1.415312 0.542221
N  1.229712 -0.289337 1.989667
N  3.308097 0.569093 1.626484
N  2.277554 -0.736121 -0.034872
N  4.405699 0.183162 -0.418972
C  -2.649894 -0.280115 0.162585
C  -2.341543 0.948916 -0.372692
C  -3.849048 -0.283069 0.908552
C  -4.43349 0.947878 0.920582
C  -0.022229 -0.819341 1.76134
C  -1.181311 1.355558 -1.176812
C  2.305888 -0.152716 1.153741
C  4.340405 0.706608 0.798117
C  3.35033 -0.529334 -0.78037
C  5.510655 1.480542 1.282768
C  -0.143541 3.198024 -2.204314
C  2.326369 -1.849352 -2.452122
H  -4.261807 -1.143489 1.410705
H  0.555787 -1.342617 -0.144219
H  -5.353841 1.226688 1.410174
H  6.195852 0.803502 1.79829
H  6.054311 1.934196 0.458039
H  5.211674 2.247324 1.993148
H  -0.362405 4.256122 -2.305616
H  0.803973 3.072122 -1.681992
H  -0.081962 2.743201 -3.191882
H  2.158763 -2.714866 -1.81238
H  2.620126 -2.188993 -3.440586
H  1.413331 -1.261187 -2.533988
H  1.328459 0.158488 2.892176
elementType: S O N C H
totalener: -1986.80183424 hartree
nucrepener: 2758.17811846 hartree
electener: -4744.97995269 hartree
oneelecener: -8213.77803703 hartree
twoeener: 3468.79808434 hartree
cpcmener: -0.04870201 hartree
kineticenergy: 1980.59351104 hartree
xcener: -147.028064319677 hartree
chargesum: 0.0000000
charge: 0.896924 0.130879 -0.507073 -0.504158 -0.276428 -0.461367 -0.445869 -0.276090 -0.205552 -0.125722 -0.403062 -0.408688 -0.368985 -0.180437 0.007985 -0.104049 -0.146061 0.354368 0.520509 0.388339 0.325333 0.449386 -0.240553 -0.125446 -0.131316 0.166199 0.223906 0.177570 0.118407 0.100335 0.100933 0.132720 0.120654 0.122331 0.125239 0.140025 0.111628 0.197184
qa: 0.8969 0.1309 -0.5071 -0.5042 -0.2764 -0.4614 -0.4459 -0.2761 -0.2056 -0.1257 -0.4031 -0.4087 -0.3690 -0.1804 0.0080 -0.1040 -0.1461 0.3544 0.5205 0.3883 0.3253 0.4494 -0.2406 -0.1254 -0.1313 0.1662 0.2239 0.1776 0.1184 0.1003 0.1009 0.1327 0.1207 0.1223 0.1252 0.1400 0.1116 0.1972
va: 5.8248 2.8731 1.9917 1.9820 2.1371 2.0469 2.0446 2.1350 3.0882 3.2131 3.0170 2.9483 3.0035 3.8597 3.6915 3.9687 4.0202 4.4203 4.0066 4.2281 3.9562 4.2369 3.9329 3.8589 3.8438 1.0059 1.0507 0.9890 0.9984 1.0126 1.0119 0.9946 0.9915 0.9927 0.9890 0.9975 0.9991 1.0150
dispcorr: -0.021356307 hartree
energy: -1986.823190542195
dipole: 15.63170 -14.98418 0.64752 7.33820 -4.24119 3.09701 -4.87912 4.73137 -0.14775
magnitude: 3.16742 au
magnitude: 8.05094 debye
