program: Orca
programVersion: 4.2.1
elementType: S S O O O O O O N N N N N C C C C C C C C C C C C H H H H H H H H H H H H H
charge: 0
multiplicity: 1
keywords: wb97x-d3
keywords: def2-TZVPP
keywords: def2/J RIJCOSX GRIDX6 NOFINALGRIDX
keywords: grid4 nofinalgrid
keywords: scfconv7
keywords: smallprint printgap noloewdin
keywords: NOSOSCF
formula: C12H13N5O6S2
InChI: InChI=1S/C12H13N5O6S2/c1-6-13-10(16-12(14-6)23-3)15-11(19)17-25(20,21)7-4-5-24-8(7)9(18)22-2/h4-5,15,17H,1-3H3
38 atoms
S  -1.75442 -1.838083 0.208693
S  -3.394383 2.074012 -0.349479
O  -2.451343 -2.643073 1.188833
O  -1.497155 -2.388854 -1.104641
O  -0.859616 2.41595 -1.508512
O  -1.038299 -0.367571 2.657353
O  -0.143196 0.294041 -1.523881
O  3.39654 -1.430382 -1.669671
N  -0.258838 -1.420316 0.802764
N  1.091383 0.031964 2.024968
N  3.089929 0.971655 1.458433
N  2.223869 -0.795327 0.174186
N  4.241507 0.2300 -0.45507
C  -2.636968 -0.309986 0.09422
C  -2.21614 0.84567 -0.522563
C  -3.910692 -0.194965 0.693431
C  -4.437809 1.048528 0.51295
C  -0.133309 -0.584505 1.882175
C  -0.962991 1.128987 -1.235903
C  2.170232 0.064339 1.179974
C  4.115238 1.010036 0.609823
C  3.268403 -0.652014 -0.623361
C  5.166598 2.028888 0.85433
C  0.320083 2.852847 -2.191716
C  2.401356 -2.42475 -1.924513
H  -4.414986 -0.982583 1.230823
H  0.539603 -1.480931 0.157438
H  -5.394819 1.405756 0.860922
H  6.109628 1.744416 0.395347
H  4.853603 2.978181 0.413486
H  5.311581 2.197452 1.918891
H  0.210847 3.925578 -2.312501
H  1.212557 2.644785 -1.602595
H  0.40719 2.382545 -3.169806
H  1.434111 -1.972186 -2.140378
H  2.310843 -3.121012 -1.091911
H  2.743749 -2.962196 -2.803459
H  1.139194 0.674376 2.806255
elementType: S O N C H
totalener: -1986.80032747 hartree
nucrepener: 2785.85179745 hartree
electener: -4772.65212492 hartree
oneelecener: -8269.03395539 hartree
twoeener: 3496.38183047 hartree
cpcmener: -0.04881837 hartree
kineticenergy: 1980.60106752 hartree
xcener: -147.028922640025 hartree
chargesum: -0.0000000
charge: 0.899025 0.132742 -0.506322 -0.503590 -0.274692 -0.455637 -0.439591 -0.275028 -0.208533 -0.124360 -0.396779 -0.404651 -0.364171 -0.191482 0.025015 -0.103594 -0.144538 0.337827 0.503174 0.371950 0.320363 0.452955 -0.237154 -0.122033 -0.127795 0.167050 0.223778 0.176179 0.099670 0.116997 0.103082 0.134546 0.115319 0.124566 0.109233 0.126082 0.140762 0.199636
qa: 0.8990 0.1327 -0.5063 -0.5036 -0.2747 -0.4556 -0.4396 -0.2750 -0.2085 -0.1244 -0.3968 -0.4047 -0.3642 -0.1915 0.0250 -0.1036 -0.1445 0.3378 0.5032 0.3719 0.3204 0.4530 -0.2372 -0.1220 -0.1278 0.1671 0.2238 0.1762 0.0997 0.1170 0.1031 0.1345 0.1153 0.1246 0.1092 0.1261 0.1408 0.1996
va: 5.8181 2.8749 1.9910 1.9807 2.1393 2.0491 2.0542 2.1365 3.0783 3.2118 3.0073 2.9436 2.9989 3.8665 3.6569 3.9727 4.0220 4.4316 4.0262 4.2372 3.9483 4.2325 3.9341 3.8612 3.8450 1.0048 1.0543 0.9895 1.0142 0.9984 1.0103 0.9946 0.9896 0.9931 0.9991 0.9886 0.9970 1.0133
dispcorr: -0.022413036 hartree
energy: -1986.822740508660
dipole: 15.82506 -15.06290 0.76216 7.11658 -3.99551 3.12107 -5.22487 4.68802 -0.53685
magnitude: 3.25733 au
magnitude: 8.27947 debye
