program: Orca
programVersion: 4.2.1
elementType: S S O O O O O O N N N N N C C C C C C C C C C C C H H H H H H H H H H H H H
charge: 0
multiplicity: 1
keywords: wb97x-d3
keywords: def2-TZVPP
keywords: def2/J RIJCOSX GRIDX6 NOFINALGRIDX
keywords: grid4 nofinalgrid
keywords: scfconv7
keywords: smallprint printgap noloewdin
keywords: NOSOSCF
formula: C12H13N5O6S2
InChI: InChI=1S/C12H13N5O6S2/c1-6-13-10(16-12(14-6)23-3)15-11(19)17-25(20,21)7-4-5-24-8(7)9(18)22-2/h4-5,15,17H,1-3H3
38 atoms
S  -1.95075 -1.73982 0.281074
S  -3.634823 2.184438 0.02958
O  -1.81392 -2.01703 1.69324
O  -2.574755 -2.721651 -0.578622
O  -1.309556 2.725457 1.499229
O  -1.024382 -0.807319 -2.347357
O  -0.49266 0.65494 1.747819
O  5.484083 0.565279 -1.035081
N  -0.4086 -1.434633 -0.254864
N  1.137804 -0.555708 -1.752502
N  2.139605 -1.039761 0.2894
N  3.317471 0.016306 -1.447635
N  4.382377 -0.444758 0.606044
C  -2.821749 -0.222692 0.024024
C  -2.483665 1.01443 0.517631
C  -4.010338 -0.218366 -0.739302
C  -4.558574 1.026611 -0.804795
C  -0.16636 -0.938204 -1.504422
C  -1.31974 1.41652 1.320206
C  2.228753 -0.534076 -0.928306
C  3.250392 -0.97211 1.026323
C  4.355009 0.03482 -0.635439
C  3.187985 -1.550256 2.393506
C  -0.223795 3.279684 2.245259
C  5.554841 1.134571 -2.341918
H  -4.437667 -1.086075 -1.216812
H  0.364973 -1.447563 0.426433
H  -5.464118 1.313074 -1.318188
H  2.285419 -1.222726 2.90852
H  3.141994 -2.6393 2.328623
H  4.061684 -1.276893 2.978921
H  0.729415 3.087495 1.754536
H  -0.402333 4.349943 2.277834
H  -0.197835 2.886288 3.260231
H  4.838658 1.946698 -2.463485
H  5.386781 0.385106 -3.114716
H  6.56343 1.527423 -2.434765
H  1.286169 -0.166722 -2.675243
elementType: S O N C H
totalener: -1986.80401807 hartree
nucrepener: 2708.97509752 hartree
electener: -4695.77911559 hartree
oneelecener: -8115.65950752 hartree
twoeener: 3419.88039193 hartree
cpcmener: -0.04324472 hartree
kineticenergy: 1980.61105980 hartree
xcener: -147.028496204518 hartree
chargesum: -0.0000000
charge: 0.883167 0.124542 -0.492845 -0.496085 -0.276687 -0.443584 -0.418856 -0.270296 -0.205051 -0.133860 -0.403714 -0.414023 -0.361669 -0.172290 -0.000470 -0.102668 -0.148044 0.353274 0.496818 0.387633 0.315246 0.460062 -0.244542 -0.125882 -0.116286 0.163227 0.219445 0.172347 0.104621 0.115811 0.099463 0.119632 0.129870 0.121006 0.116882 0.117367 0.132452 0.193985
qa: 0.8832 0.1245 -0.4928 -0.4961 -0.2767 -0.4436 -0.4189 -0.2703 -0.2051 -0.1339 -0.4037 -0.4140 -0.3617 -0.1723 -0.0005 -0.1027 -0.1480 0.3533 0.4968 0.3876 0.3152 0.4601 -0.2445 -0.1259 -0.1163 0.1632 0.2194 0.1723 0.1046 0.1158 0.0995 0.1196 0.1299 0.1210 0.1169 0.1174 0.1325 0.1940
va: 5.8475 2.8653 1.9972 2.0063 2.1290 2.0713 2.0713 2.1349 3.0754 3.2055 3.0047 2.9596 3.0172 3.8773 3.6939 3.9715 4.0195 4.4252 4.0389 4.2179 3.9376 4.2374 3.9320 3.8640 3.8473 1.0078 1.0635 0.9908 1.0067 0.9995 1.0176 0.9917 0.9947 0.9928 0.9951 0.9949 0.9943 1.0156
dispcorr: -0.019749304 hartree
energy: -1986.823767371429
dipole: 17.37033 -16.11060 1.25973 7.45634 -4.20429 3.25205 2.55500 -3.23521 -0.68022
magnitude: 3.55323 au
magnitude: 9.03159 debye
