program: Orca
programVersion: 4.2.1
elementType: S S O O O O O O N N N N N C C C C C C C C C C C C H H H H H H H H H H H H H
charge: 0
multiplicity: 1
keywords: wb97x-d3
keywords: def2-TZVPP
keywords: def2/J RIJCOSX GRIDX6 NOFINALGRIDX
keywords: grid4 nofinalgrid
keywords: scfconv7
keywords: smallprint printgap noloewdin
keywords: NOSOSCF
formula: C12H13N5O6S2
InChI: InChI=1S/C12H13N5O6S2/c1-6-13-10(16-12(14-6)23-3)15-11(19)17-25(20,21)7-4-5-24-8(7)9(18)22-2/h4-5,15,17H,1-3H3
38 atoms
S  -1.731383 -0.474426 -1.955173
S  -3.671028 1.39408 1.368082
O  -2.412909 -1.634688 -2.484955
O  -1.36448 0.604133 -2.844054
O  -1.227936 2.764434 1.373393
O  -1.252864 -2.532648 0.100735
O  -0.248435 1.865102 -0.428519
O  5.145678 -1.127901 1.847693
N  -0.312732 -0.94918 -1.233046
N  0.920829 -2.022255 0.421288
N  2.177203 -0.37235 -0.626229
N  3.033082 -1.621382 1.169173
N  4.337152 0.067406 0.161003
C  -2.723657 0.126897 -0.62008
C  -2.400518 1.142613 0.24849
C  -3.994943 -0.438581 -0.376183
C  -4.618126 0.164893 0.674269
C  -0.290654 -1.877632 -0.227962
C  -1.1735 1.948399 0.335855
C  2.079843 -1.306191 0.303019
C  3.329343 0.29993 -0.655185
C  4.133256 -0.906096 1.046482
C  3.457867 1.36618 -1.681667
C  -0.096415 3.604722 1.610749
C  5.026602 -2.139489 2.847587
H  -4.425749 -1.249439 -0.942395
H  0.529085 -0.366921 -1.369143
H  -5.594836 -0.065424 1.072534
H  4.359291 1.954026 -1.531789
H  3.494118 0.917742 -2.676332
H  2.586353 2.020713 -1.659663
H  0.065491 4.294182 0.782584
H  -0.329394 4.168391 2.509256
H  0.805066 3.015308 1.776654
H  4.860929 -3.121762 2.405978
H  4.221361 -1.91665 3.547199
H  5.974853 -2.138275 3.377753
H  0.916243 -2.720196 1.154593
elementType: S O N C H
totalener: -1986.80411881 hartree
nucrepener: 2715.85413879 hartree
electener: -4702.65825761 hartree
oneelecener: -8129.32341713 hartree
twoeener: 3426.66515952 hartree
cpcmener: -0.04320130 hartree
kineticenergy: 1980.60452206 hartree
xcener: -147.027227730830 hartree
chargesum: -0.0000000
charge: 0.882175 0.123876 -0.494321 -0.490779 -0.277157 -0.443532 -0.417527 -0.270558 -0.213870 -0.135893 -0.397962 -0.413618 -0.360968 -0.179866 -0.002049 -0.097172 -0.148400 0.356726 0.499270 0.389022 0.311492 0.460816 -0.246165 -0.122907 -0.116364 0.163673 0.220172 0.172455 0.099650 0.114976 0.105126 0.121087 0.129628 0.117981 0.117297 0.117474 0.132162 0.194051
qa: 0.8822 0.1239 -0.4943 -0.4908 -0.2772 -0.4435 -0.4175 -0.2706 -0.2139 -0.1359 -0.3980 -0.4136 -0.3610 -0.1799 -0.0020 -0.0972 -0.1484 0.3567 0.4993 0.3890 0.3115 0.4608 -0.2462 -0.1229 -0.1164 0.1637 0.2202 0.1725 0.0997 0.1150 0.1051 0.1211 0.1296 0.1180 0.1173 0.1175 0.1322 0.1941
va: 5.8550 2.8678 2.0070 1.9993 2.1277 2.0708 2.0746 2.1347 3.0704 3.2086 3.0058 2.9607 3.0176 3.8765 3.6870 3.9636 4.0200 4.4216 4.0333 4.2188 3.9362 4.2349 3.9272 3.8627 3.8469 1.0076 1.0681 0.9909 1.0186 0.9997 1.0090 0.9928 0.9950 0.9917 0.9949 0.9950 0.9945 1.0156
dispcorr: -0.020071830 hartree
energy: -1986.824190642512
dipole: 16.64957 -15.73859 0.91097 4.80235 -3.85960 0.94275 8.18006 -4.78052 3.39954
magnitude: 3.64356 au
magnitude: 9.26120 debye
