program: Orca
programVersion: 4.2.1
elementType: S S O O O O O O N N N N N C C C C C C C C C C C C H H H H H H H H H H H H H
charge: 0
multiplicity: 1
keywords: wb97x-d3
keywords: def2-TZVPP
keywords: def2/J RIJCOSX GRIDX6 NOFINALGRIDX
keywords: grid4 nofinalgrid
keywords: scfconv7
keywords: smallprint printgap noloewdin
keywords: NOSOSCF
formula: C12H13N5O6S2
InChI: InChI=1S/C12H13N5O6S2/c1-6-13-10(16-12(14-6)23-3)15-11(19)17-25(20,21)7-4-5-24-8(7)9(18)22-2/h4-5,15,17H,1-3H3
38 atoms
S  -1.621606 -1.660726 -0.019148
S  -3.781008 2.009299 0.459005
O  -1.314975 -2.028233 1.341338
O  -2.23306 -2.59789 -0.925854
O  -1.700084 2.389689 2.3054
O  -0.955918 -0.448778 -2.671064
O  -0.323524 0.737526 1.684993
O  3.672477 -0.968298 1.587663
N  -0.16839 -1.138899 -0.647975
N  1.235179 -0.152068 -2.220096
N  3.433617 0.423978 -2.109668
N  2.403076 -0.604951 -0.26208
N  4.668778 0.009801 -0.147538
C  -2.642779 -0.210524 -0.042362
C  -2.483572 0.920682 0.719713
C  -3.807867 -0.187229 -0.839726
C  -4.516032 0.962301 -0.662067
C  -0.049701 -0.584928 -1.892167
C  -1.378826 1.303482 1.610509
C  2.391441 -0.117341 -1.494266
C  4.547341 0.461648 -1.387542
C  3.568072 -0.51278 0.364954
C  5.757735 1.072172 -2.007701
C  -0.710945 2.910796 3.185097
C  2.526811 -1.544658 2.208348
H  -4.091171 -0.982456 -1.510395
H  0.633267 -1.095922 -0.012671
H  -5.437684 1.240339 -1.148368
H  5.592814 1.290218 -3.058738
H  6.008171 1.998357 -1.488839
H  6.613451 0.407867 -1.896907
H  -1.152374 3.792942 3.639044
H  -0.452107 2.191423 3.961674
H  0.194726 3.191222 2.6474
H  1.715266 -0.824756 2.309083
H  2.858549 -1.857795 3.194029
H  2.165351 -2.414943 1.659322
H  1.307761 0.246606 -3.144932
totalener: -1986.77572328 hartree
nucrepener: 2718.54584968 hartree
electener: -4705.32157296 hartree
oneelecener: -8133.98328451 hartree
twoeener: 3428.66171155 hartree
kineticenergy: 1980.64918887 hartree
xcener: -147.025113606935 hartree
chargesum: 0.0000000
charge: 0.858445 0.117804 -0.446319 -0.433565 -0.272069 -0.362878 -0.390299 -0.234170 -0.213653 -0.162135 -0.363178 -0.416946 -0.307321 -0.195923 -0.025559 -0.047371 -0.143064 0.330483 0.485821 0.381950 0.256812 0.398774 -0.224275 -0.131962 -0.140115 0.150626 0.216712 0.135072 0.100635 0.096905 0.101189 0.122161 0.115362 0.112844 0.121582 0.125439 0.110226 0.171959
qa: 0.8584 0.1178 -0.4463 -0.4336 -0.2721 -0.3629 -0.3903 -0.2342 -0.2137 -0.1621 -0.3632 -0.4169 -0.3073 -0.1959 -0.0256 -0.0474 -0.1431 0.3305 0.4858 0.3819 0.2568 0.3988 -0.2243 -0.1320 -0.1401 0.1506 0.2167 0.1351 0.1006 0.0969 0.1012 0.1222 0.1154 0.1128 0.1216 0.1254 0.1102 0.1720
va: 5.8757 2.8547 2.0512 2.0762 2.1202 2.1539 2.1071 2.1717 3.0985 3.1822 3.0275 2.9607 3.0135 3.9458 3.7039 3.9690 4.0096 4.4223 4.0218 4.2018 4.0244 4.2762 3.9037 3.8886 3.8662 1.0159 1.0461 1.0036 1.0170 1.0068 1.0095 0.9946 0.9936 0.9954 0.9986 0.9973 0.9953 1.0347
dispcorr: -0.020422156 hartree
energy: -1986.796145438265
dipole: 15.21879 -15.07070 0.14809 6.51909 -4.51744 2.00165 5.02347 -4.48581 0.53766
magnitude: 2.07789 au
magnitude: 5.28157 debye
