program: Orca
programVersion: 4.2.1
elementType: S S O O O O O O N N N N N C C C C C C C C C C C C H H H H H H H H H H H H H
charge: 0
multiplicity: 1
keywords: wb97x-d3
keywords: def2-TZVPP
keywords: def2/J RIJCOSX GRIDX6 NOFINALGRIDX
keywords: grid4 nofinalgrid
keywords: scfconv7
keywords: smallprint printgap noloewdin
keywords: NOSOSCF
formula: C12H13N5O6S2
InChI: InChI=1S/C12H13N5O6S2/c1-6-13-10(16-12(14-6)23-3)15-11(19)17-25(20,21)7-4-5-24-8(7)9(18)22-2/h4-5,15,17H,1-3H3
38 atoms
S  -1.609535 -1.658324 0.277941
S  -3.811934 1.918742 -0.5729
O  -2.18818 -2.481464 1.308415
O  -1.33411 -2.187775 -1.034939
O  -1.75913 2.119698 -2.473969
O  -0.884748 -0.124564 2.744009
O  -0.374391 0.527086 -1.72837
O  3.631856 -1.147442 -1.543602
N  -0.146421 -1.052756 0.79888
N  1.291403 0.123444 2.199946
N  3.485544 0.678077 1.964521
N  2.409584 -0.562201 0.280422
N  4.672494 0.027161 0.037084
C  -2.64515 -0.223513 0.151956
C  -2.510077 0.816259 -0.735006
C  -3.795959 -0.118962 0.963445
C  -4.517357 0.998527 0.671677
C  0.000998 -0.350577 1.9625
C  -1.425956 1.103526 -1.684906
C  2.429484 0.069578 1.446467
C  4.581848 0.626038 1.214424
C  3.557325 -0.549619 -0.38179
C  5.795744 1.322619 1.727745
C  -0.787673 2.550027 -3.419853
C  2.469928 -1.786421 -2.06488
H  -4.059593 -0.836045 1.724242
H  0.638149 -1.084238 0.141952
H  -5.432962 1.322713 1.140494
H  5.790025 2.358195 1.381395
H  5.804881 1.339274 2.814692
H  6.699638 0.853691 1.347802
H  -0.545789 1.75836 -4.128712
H  -1.236954 3.38603 -3.947669
H  0.129315 2.877603 -2.929808
H  1.659043 -1.07804 -2.231114
H  2.117895 -2.582922 -1.408095
H  2.777117 -2.216583 -3.013686
H  1.386856 0.630331 3.068031
totalener: -1986.77572227 hartree
nucrepener: 2719.17416120 hartree
electener: -4705.94988347 hartree
oneelecener: -8135.23754042 hartree
twoeener: 3429.28765694 hartree
kineticenergy: 1980.64628508 hartree
xcener: -147.024633672173 hartree
chargesum: 0.0000000
charge: 0.858411 0.117830 -0.433867 -0.445972 -0.271977 -0.362541 -0.390567 -0.233642 -0.214300 -0.161467 -0.367568 -0.417203 -0.301894 -0.194294 -0.026399 -0.048495 -0.142321 0.329435 0.486243 0.377049 0.254228 0.406552 -0.230108 -0.132299 -0.140114 0.150591 0.217067 0.134775 0.096361 0.101581 0.104916 0.115204 0.122314 0.113074 0.121818 0.110113 0.125606 0.171860
qa: 0.8584 0.1178 -0.4339 -0.4460 -0.2720 -0.3625 -0.3906 -0.2336 -0.2143 -0.1615 -0.3676 -0.4172 -0.3019 -0.1943 -0.0264 -0.0485 -0.1423 0.3294 0.4862 0.3770 0.2542 0.4066 -0.2301 -0.1323 -0.1401 0.1506 0.2171 0.1348 0.0964 0.1016 0.1049 0.1152 0.1223 0.1131 0.1218 0.1101 0.1256 0.1719
va: 5.8749 2.8548 2.0758 2.0512 2.1197 2.1543 2.1069 2.1728 3.0982 3.1804 3.0199 2.9606 3.0183 3.9500 3.7019 3.9703 4.0089 4.4237 4.0236 4.2140 4.0270 4.2648 3.9100 3.8887 3.8656 1.0159 1.0457 1.0037 1.0046 1.0121 1.0136 0.9936 0.9946 0.9952 0.9990 0.9955 0.9972 1.0347
dispcorr: -0.020443443 hartree
energy: -1986.796165712044
dipole: 15.01483 -14.90402 0.11081 6.09526 -4.14448 1.95078 -6.08072 5.30988 -0.77084
magnitude: 2.10048 au
magnitude: 5.33899 debye
