program: Orca
programVersion: 4.2.1
elementType: S S O O O O O O N N N N N C C C C C C C C C C C C H H H H H H H H H H H H H
charge: 0
multiplicity: 1
keywords: wb97x-d3
keywords: def2-TZVPP
keywords: def2/J RIJCOSX GRIDX6 NOFINALGRIDX
keywords: grid4 nofinalgrid
keywords: scfconv7
keywords: smallprint printgap noloewdin
keywords: NOSOSCF
formula: C12H13N5O6S2
InChI: InChI=1S/C12H13N5O6S2/c1-6-13-10(16-12(14-6)23-3)15-11(19)17-25(20,21)7-4-5-24-8(7)9(18)22-2/h4-5,15,17H,1-3H3
38 atoms
S  -1.621095 -1.660585 -0.020635
S  -3.779161 2.010286 0.460504
O  -1.315427 -2.029872 1.33967
O  -2.2329 -2.596013 -0.928895
O  -1.696324 2.389556 2.305779
O  -0.952585 -0.445167 -2.669975
O  -0.321807 0.735505 1.684562
O  3.670243 -0.969986 1.59366
N  -0.167478 -1.139442 -0.647605
N  1.237211 -0.14588 -2.215241
N  3.433519 0.436494 -2.097469
N  2.402744 -0.601843 -0.255983
N  4.667272 0.01895 -0.135054
C  -2.642127 -0.21006 -0.042244
C  -2.482513 0.920614 0.720717
C  -3.8071 -0.185596 -0.839336
C  -4.514519 0.964243 -0.660878
C  -0.047157 -0.581735 -1.890338
C  -1.377133 1.302448 1.611218
C  2.393344 -0.109847 -1.488267
C  4.547571 0.474489 -1.371697
C  3.564709 -0.510229 0.373001
C  5.758907 1.058191 -2.015091
C  -0.705074 2.910462 3.18325
C  2.524532 -1.547748 2.213147
H  -4.090903 -0.979974 -1.510646
H  0.631946 -1.094557 -0.009872
H  -5.435908 1.242578 -1.147314
H  5.493084 1.910419 -2.636837
H  6.490971 1.350009 -1.267358
H  6.218336 0.313009 -2.667282
H  -1.144684 3.7936 3.637078
H  -0.445725 2.191525 3.96007
H  0.200029 3.189224 2.643627
H  1.714245 -0.826944 2.317637
H  2.85693 -1.865703 3.197056
H  2.161153 -2.414939 1.660488
H  1.309258 0.255837 -3.138846
totalener: -1986.77579894 hartree
nucrepener: 2718.87171229 hartree
electener: -4705.64751123 hartree
oneelecener: -8134.64206081 hartree
twoeener: 3428.99454958 hartree
kineticenergy: 1980.64774791 hartree
xcener: -147.024840819792 hartree
chargesum: -0.0000000
charge: 0.858594 0.117830 -0.446558 -0.433713 -0.272045 -0.362959 -0.391100 -0.233240 -0.213753 -0.161451 -0.369342 -0.417097 -0.299777 -0.195820 -0.025707 -0.047508 -0.142926 0.330217 0.486244 0.373917 0.253475 0.409157 -0.229420 -0.131897 -0.140325 0.150603 0.217243 0.134982 0.099310 0.104897 0.098295 0.122160 0.115298 0.112912 0.121927 0.125606 0.110200 0.171770
qa: 0.8586 0.1178 -0.4466 -0.4337 -0.2720 -0.3630 -0.3911 -0.2332 -0.2138 -0.1615 -0.3693 -0.4171 -0.2998 -0.1958 -0.0257 -0.0475 -0.1429 0.3302 0.4862 0.3739 0.2535 0.4092 -0.2294 -0.1319 -0.1403 0.1506 0.2172 0.1350 0.0993 0.1049 0.0983 0.1222 0.1153 0.1129 0.1219 0.1256 0.1102 0.1718
va: 5.8762 2.8549 2.0509 2.0761 2.1204 2.1537 2.1063 2.1730 3.0987 3.1799 3.0172 2.9593 3.0225 3.9458 3.7036 3.9693 4.0096 4.4224 4.0214 4.2196 4.0276 4.2585 3.9090 3.8885 3.8662 1.0159 1.0453 1.0036 1.0104 1.0153 1.0048 0.9947 0.9936 0.9954 0.9987 0.9972 0.9953 1.0348
dispcorr: -0.020433324 hartree
energy: -1986.796232260125
dipole: 15.21079 -15.05595 0.15484 6.39232 -4.41548 1.97684 4.89348 -4.37639 0.51710
magnitude: 2.04921 au
magnitude: 5.20868 debye
