program: Orca
programVersion: 5.0.2
elementType: S O O O O O O N N N N N C C C C C C C C C C C C C C H H H H H H H H H H H H H H H
charge: 0
multiplicity: 1
keywords: wb97x-d3
keywords: def2-TZVPP
keywords: def2/J RIJCOSX
keywords: DEFGRID2
keywords: scfconv7
keywords: smallprint printgap noloewdin
keywords: NOSOSCF
formula: C14H15N5O6S
InChI: InChI=1S/C14H15N5O6S/c1-8-15-12(18-14(16-8)25-3)17-13(21)19-26(22,23)10-7-5-4-6-9(10)11(20)24-2/h4-7,17,19H,1-3H3
41 atoms
S  1.473668 2.092013 -0.171587
O  1.74804 3.107536 0.82494
O  1.136594 2.514067 -1.515874
O  1.046779 -0.314769 -2.270691
O  0.931086 -1.957881 -0.756372
O  1.094094 0.602816 2.321408
O  -4.929543 -2.338341 1.313601
N  0.187351 1.15155 0.313239
N  -0.959444 -0.186618 1.838319
N  -2.229727 0.174087 -0.075457
N  -2.936362 -1.286763 1.625537
N  -4.256308 -0.977842 -0.306066
C  2.828954 0.940674 -0.17277
C  2.696177 -0.374062 -0.62475
C  4.03096 1.398005 0.345075
C  3.786154 -1.22699 -0.514346
C  5.122603 0.544589 0.402271
C  4.997368 -0.768127 -0.018032
C  1.450201 -0.963934 -1.201343
C  0.170961 0.539176 1.538333
C  -2.076806 -0.4359 1.089485
C  -3.337763 -0.138233 -0.748117
C  -4.00448 -1.513796 0.88434
C  -0.113877 -0.807807 -2.952348
C  -3.537755 0.486572 -2.080627
C  -4.765088 -2.9742 2.582259
H  4.127773 2.408759 0.715136
H  -0.646931 1.074023 -0.291543
H  3.69344 -2.25584 -0.836096
H  6.0616 0.907351 0.796294
H  5.839094 -1.443926 0.045236
H  -4.538166 0.910533 -2.158467
H  -3.450256 -0.27448 -2.858244
H  -2.800777 1.261621 -2.272315
H  -0.35219 -0.066078 -3.707556
H  0.10079 -1.761699 -3.432408
H  -3.863709 -3.58461 2.608999
H  -4.737814 -2.245918 3.391572
H  -5.635452 -3.612438 2.702623
H  -0.95567 -0.924211 -2.27397
H  -0.918395 -0.662451 2.731844
elementType: S O N C H
totalener: -1666.03714567 hartree
nucrepener: 2711.37072243 hartree
electener: -4377.40786809 hartree
oneelecener: -7673.32986575 hartree
twoeener: 3295.92199766 hartree
cpcmener: -0.05904749 hartree
kineticenergy: 1660.08527329 hartree
xcener: -135.885026410077 hartree
chargesum: 0.0000000
charge: 0.884500 -0.508258 -0.510172 -0.254269 -0.457301 -0.471114 -0.279418 -0.228383 -0.128827 -0.421744 -0.416974 -0.383637 -0.169721 0.113759 -0.034416 -0.204515 -0.164011 -0.106518 0.489319 0.387315 0.408083 0.346399 0.464480 -0.126855 -0.272713 -0.116461 0.150666 0.232658 0.150919 0.167034 0.167804 0.122945 0.116702 0.105742 0.134190 0.140050 0.118323 0.119529 0.132265 0.104110 0.198514
qa: 0.8845 -0.5083 -0.5102 -0.2543 -0.4573 -0.4711 -0.2794 -0.2284 -0.1288 -0.4217 -0.4170 -0.3836 -0.1697 0.1138 -0.0344 -0.2045 -0.1640 -0.1065 0.4893 0.3873 0.4081 0.3464 0.4645 -0.1269 -0.2727 -0.1165 0.1507 0.2327 0.1509 0.1670 0.1678 0.1229 0.1167 0.1057 0.1342 0.1400 0.1183 0.1195 0.1323 0.1041 0.1985
va: 5.7938 1.9889 1.9629 2.1536 2.0311 2.0385 2.1271 3.0694 3.2218 2.9882 2.9609 3.0014 3.8194 3.5581 3.8898 4.0277 3.9596 3.8988 4.0331 4.3950 4.1989 3.8756 4.2460 3.8488 3.9505 3.8458 1.0148 1.0431 1.0081 0.9874 0.9860 1.0093 0.9974 1.0075 0.9935 0.9933 0.9946 0.9941 0.9944 0.9904 1.0126
dispcorr: -0.023883430 hartree
energy: -1666.061029096828
dipole: -7.65326 7.08235 -0.57091 -9.79541 7.52322 -2.27219 -5.19278 4.65823 -0.53455
magnitude: 2.40302 au
magnitude: 6.10799 debye
