program: Orca
programVersion: 5.0.2
elementType: S O O O O O O N N N N N C C C C C C C C C C C C C C H H H H H H H H H H H H H H H
charge: 0
multiplicity: 1
keywords: wb97x-d3
keywords: def2-TZVPP
keywords: def2/J RIJCOSX
keywords: DEFGRID2
keywords: scfconv7
keywords: smallprint printgap noloewdin
keywords: NOSOSCF
formula: C14H15N5O6S
InChI: InChI=1S/C14H15N5O6S/c1-8-15-12(18-14(16-8)25-3)17-13(21)19-26(22,23)10-7-5-4-6-9(10)11(20)24-2/h4-7,17,19H,1-3H3
41 atoms
S  1.79058 0.514679 1.630351
O  1.823918 -0.859008 2.095055
O  2.247448 1.577221 2.496949
O  2.555097 -2.76992 -0.438266
O  0.619245 -1.665965 -0.619899
O  0.457882 2.885342 0.446202
O  -5.494596 0.193366 -1.347057
N  0.195027 0.765676 1.2257
N  -1.523666 1.8648 0.109101
N  -2.145551 -0.305377 0.662982
N  -3.527272 1.082097 -0.633659
N  -4.1933 -1.123373 -0.123384
C  2.670303 0.611291 0.094117
C  2.669285 -0.471039 -0.786886
C  3.414997 1.750168 -0.168339
C  3.431569 -0.387623 -1.943319
C  4.154234 1.824841 -1.339218
C  4.161272 0.759424 -2.223224
C  1.822628 -1.688351 -0.586342
C  -0.231283 1.901852 0.596221
C  -2.42158 0.834537 0.054867
C  -3.06391 -1.266275 0.539139
C  -4.37025 0.070421 -0.686537
C  1.861633 -4.011859 -0.274703
C  -2.770095 -2.563631 1.200732
C  -5.775122 1.422227 -2.015787
H  3.431732 2.574725 0.529926
H  -0.447084 -0.042899 1.248201
H  3.446967 -1.217051 -2.638538
H  4.729129 2.715945 -1.551116
H  4.741331 0.813203 -3.134767
H  -3.512052 -3.315484 0.94644
H  -2.758555 -2.434052 2.284548
H  -1.779648 -2.917295 0.911982
H  2.632471 -4.766091 -0.146493
H  1.223962 -3.991849 0.60898
H  -6.736392 1.277114 -2.501219
H  -5.847391 2.252839 -1.313967
H  -5.020922 1.648399 -2.769227
H  1.263134 -4.250412 -1.153673
H  -1.81171 2.713881 -0.362444
elementType: S O N C H
totalener: -1666.04108882 hartree
nucrepener: 2668.49056585 hartree
electener: -4334.53165467 hartree
oneelecener: -7588.44447975 hartree
twoeener: 3253.91282509 hartree
cpcmener: -0.04456599 hartree
kineticenergy: 1660.10153059 hartree
xcener: -135.883881763052 hartree
chargesum: -0.0000000
charge: 0.884684 -0.509790 -0.489878 -0.265105 -0.432535 -0.455540 -0.268850 -0.207472 -0.140685 -0.415867 -0.418788 -0.366327 -0.128778 0.072534 -0.014579 -0.193544 -0.163317 -0.105783 0.449624 0.376528 0.397438 0.323717 0.467595 -0.128792 -0.237630 -0.117309 0.147684 0.218912 0.149855 0.164290 0.163806 0.099403 0.112578 0.098918 0.133403 0.119755 0.130940 0.117599 0.117220 0.120680 0.193410
qa: 0.8847 -0.5098 -0.4899 -0.2651 -0.4325 -0.4555 -0.2688 -0.2075 -0.1407 -0.4159 -0.4188 -0.3663 -0.1288 0.0725 -0.0146 -0.1935 -0.1633 -0.1058 0.4496 0.3765 0.3974 0.3237 0.4676 -0.1288 -0.2376 -0.1173 0.1477 0.2189 0.1499 0.1643 0.1638 0.0994 0.1126 0.0989 0.1334 0.1198 0.1309 0.1176 0.1172 0.1207 0.1934
va: 5.8190 1.9798 2.0130 2.1433 2.0629 2.0624 2.1364 3.0722 3.2039 3.0005 2.9575 3.0194 3.7841 3.7117 3.8539 4.0269 3.9545 3.8995 4.0898 4.4086 4.2197 3.9345 4.2309 3.8609 3.9300 3.8496 1.0220 1.0664 1.0057 0.9883 0.9871 1.0194 1.0014 1.0084 0.9942 0.9907 0.9946 0.9944 0.9949 0.9928 1.0161
dispcorr: -0.021708356 hartree
energy: -1666.062797174405
dipole: -5.98448 5.42098 -0.56351 -8.94305 8.23032 -0.71273 -8.93329 6.14212 -2.79117
magnitude: 2.93533 au
magnitude: 7.46101 debye
