program: Orca
programVersion: 5.0.2
elementType: S O O O O O O N N N N N C C C C C C C C C C C C C C H H H H H H H H H H H H H H H
charge: 0
multiplicity: 1
keywords: wb97x-d3
keywords: def2-TZVPP
keywords: def2/J RIJCOSX
keywords: DEFGRID2
keywords: scfconv7
keywords: smallprint printgap noloewdin
keywords: NOSOSCF
formula: C14H15N5O6S
InChI: InChI=1S/C14H15N5O6S/c1-8-15-12(18-14(16-8)25-3)17-13(21)19-26(22,23)10-7-5-4-6-9(10)11(20)24-2/h4-7,17,19H,1-3H3
41 atoms
S  1.682358 0.750051 1.585091
O  1.701702 -0.550487 2.22862
O  2.062706 1.932996 2.323706
O  2.572556 -2.801065 -0.141083
O  0.664342 -1.669366 -0.406722
O  0.397424 2.913914 0.010391
O  -5.535033 -0.013116 -1.480392
N  0.11508 0.914148 1.054245
N  -1.573541 1.846089 -0.240763
N  -2.201773 -0.226355 0.602541
N  -3.575456 0.968497 -0.879294
N  -4.247249 -1.144082 -0.068434
C  2.673495 0.656306 0.115404
C  2.745754 -0.530926 -0.616884
C  3.456266 1.751085 -0.213969
C  3.622903 -0.59578 -1.690634
C  4.310935 1.675157 -1.303798
C  4.393505 0.504981 -2.03845
C  1.866713 -1.712033 -0.356822
C  -0.293636 1.954626 0.270089
C  -2.473175 0.819641 -0.158142
C  -3.121401 -1.192285 0.6146
C  -4.417495 -0.042316 -0.796938
C  1.850553 -4.02236 0.04522
C  -2.837042 -2.374863 1.468299
C  -5.799949 1.112032 -2.317696
H  3.415895 2.65677 0.37398
H  -0.525839 0.111919 1.166985
H  3.697284 -1.505606 -2.271725
H  4.918095 2.530427 -1.567113
H  5.064504 0.439497 -2.884506
H  -3.547292 -3.176579 1.285564
H  -2.896268 -2.090911 2.521163
H  -1.823257 -2.734762 1.292142
H  2.603144 -4.796028 0.166041
H  1.230004 -3.978405 0.94038
H  -6.762987 0.912417 -2.779605
H  -5.859858 2.035322 -1.741918
H  -5.042556 1.218211 -3.094403
H  1.22893 -4.25366 -0.81966
H  -1.853707 2.621158 -0.829901
elementType: S O N C H
totalener: -1666.04126881 hartree
nucrepener: 2662.22419155 hartree
electener: -4328.26546035 hartree
oneelecener: -7575.99192395 hartree
twoeener: 3247.72646360 hartree
cpcmener: -0.04473665 hartree
kineticenergy: 1660.10193013 hartree
xcener: -135.884664496113 hartree
chargesum: -0.0000000
charge: 0.886214 -0.511547 -0.491401 -0.267539 -0.436185 -0.457037 -0.269413 -0.204077 -0.139670 -0.413735 -0.418706 -0.367547 -0.132967 0.069460 -0.009912 -0.193932 -0.161939 -0.105822 0.457893 0.376189 0.397580 0.321705 0.467643 -0.127389 -0.238954 -0.116752 0.147724 0.218325 0.148912 0.164126 0.163821 0.100127 0.113954 0.099242 0.132360 0.121481 0.131302 0.116694 0.117186 0.118954 0.193630
qa: 0.8862 -0.5115 -0.4914 -0.2675 -0.4362 -0.4570 -0.2694 -0.2041 -0.1397 -0.4137 -0.4187 -0.3675 -0.1330 0.0695 -0.0099 -0.1939 -0.1619 -0.1058 0.4579 0.3762 0.3976 0.3217 0.4676 -0.1274 -0.2390 -0.1168 0.1477 0.2183 0.1489 0.1641 0.1638 0.1001 0.1140 0.0992 0.1324 0.1215 0.1313 0.1167 0.1172 0.1190 0.1936
va: 5.8174 1.9776 2.0114 2.1448 2.0594 2.0621 2.1363 3.0738 3.2050 3.0023 2.9575 3.0186 3.7908 3.6981 3.8523 4.0281 3.9526 3.9002 4.0803 4.4112 4.2194 3.9360 4.2316 3.8609 3.9315 3.8495 1.0217 1.0666 1.0084 0.9884 0.9873 1.0185 1.0009 1.0088 0.9944 0.9901 0.9947 0.9949 0.9950 0.9937 1.0158
dispcorr: -0.021434385 hartree
energy: -1666.062703192356
dipole: -5.43097 5.06831 -0.36266 -10.14591 9.03948 -1.10643 -7.95362 5.24253 -2.71109
magnitude: 2.95055 au
magnitude: 7.49969 debye
