program: Orca
programVersion: 5.0.2
elementType: S O O O O O O N N N N N C C C C C C C C C C C C C C H H H H H H H H H H H H H H H
charge: 0
multiplicity: 1
keywords: wb97x-d3
keywords: def2-TZVPP
keywords: def2/J RIJCOSX
keywords: DEFGRID2
keywords: scfconv7
keywords: smallprint printgap noloewdin
keywords: NOSOSCF
formula: C14H15N5O6S
InChI: InChI=1S/C14H15N5O6S/c1-8-15-12(18-14(16-8)25-3)17-13(21)19-26(22,23)10-7-5-4-6-9(10)11(20)24-2/h4-7,17,19H,1-3H3
41 atoms
S  1.728218 0.665656 1.533634
O  1.758048 -0.675022 2.07435
O  2.09983 1.802957 2.334113
O  2.820981 -2.773468 -0.401246
O  0.847056 -1.730936 -0.532823
O  0.378921 2.99492 0.217309
O  -5.767355 0.584097 -1.012611
N  0.160423 0.859041 0.990894
N  -1.617249 1.978732 -0.016626
N  -2.178553 -0.238238 0.395396
N  -3.719189 1.284659 -0.527926
N  -4.327101 -0.968596 -0.175333
C  2.707903 0.683862 0.047323
C  2.860698 -0.468169 -0.724567
C  3.40283 1.843887 -0.252424
C  3.747227 -0.436851 -1.792865
C  4.259751 1.865912 -1.342103
C  4.437069 0.725063 -2.1050
C  2.046751 -1.706358 -0.516971
C  -0.283977 2.006928 0.394738
C  -2.531333 0.96638 -0.042037
C  -3.107358 -1.178403 0.29265
C  -4.575552 0.279896 -0.555739
C  2.164997 -4.022341 -0.216788
C  -2.739862 -2.547097 0.74931
C  -6.749482 -0.440061 -1.074224
H  3.279143 2.721049 0.365669
H  -0.437432 0.024847 0.947901
H  3.89438 -1.324083 -2.393793
H  4.796344 2.773334 -1.582582
H  5.117045 0.73323 -2.946302
H  -3.445874 -3.283896 0.376885
H  -2.748017 -2.583637 1.840362
H  -1.729223 -2.791764 0.426025
H  2.955324 -4.760991 -0.116949
H  1.555956 -4.016523 0.68704
H  -6.444018 -1.252098 -1.733896
H  -6.962889 -0.854465 -0.089077
H  -7.641551 0.036676 -1.470702
H  1.533996 -4.275046 -1.069533
H  -1.939954 2.851793 -0.408308
totalener: -1666.00867521 hartree
nucrepener: 2642.95395376 hartree
electener: -4308.96262897 hartree
oneelecener: -7536.55086637 hartree
twoeener: 3227.58823740 hartree
kineticenergy: 1660.16822615 hartree
xcener: -135.886513230232 hartree
chargesum: 0.0000000
charge: 0.867136 -0.464375 -0.430034 -0.254218 -0.379527 -0.372804 -0.239319 -0.214093 -0.161507 -0.393959 -0.339763 -0.378106 -0.191117 0.097456 0.027196 -0.182078 -0.143704 -0.092259 0.412282 0.348347 0.394346 0.270562 0.415296 -0.137862 -0.241789 -0.121170 0.139735 0.211617 0.119495 0.134702 0.132553 0.099885 0.101672 0.104972 0.122905 0.116816 0.108273 0.108620 0.122700 0.108330 0.172793
qa: 0.8671 -0.4644 -0.4300 -0.2542 -0.3795 -0.3728 -0.2393 -0.2141 -0.1615 -0.3940 -0.3398 -0.3781 -0.1911 0.0975 0.0272 -0.1821 -0.1437 -0.0923 0.4123 0.3483 0.3943 0.2706 0.4153 -0.1379 -0.2418 -0.1212 0.1397 0.2116 0.1195 0.1347 0.1326 0.0999 0.1017 0.1050 0.1229 0.1168 0.1083 0.1086 0.1227 0.1083 0.1728
va: 5.8468 2.0311 2.0840 2.1392 2.1186 2.1438 2.1592 3.0936 3.1804 3.0112 2.9867 3.0005 3.9223 3.6867 3.8804 4.0661 3.9788 3.9412 4.1268 4.4067 4.1714 4.0041 4.2691 3.8919 3.9144 3.8726 1.0279 1.0641 1.0197 0.9992 0.9983 1.0173 1.0039 1.0131 0.9957 0.9938 0.9987 0.9987 0.9941 0.9936 1.0332
dispcorr: -0.021061665 hartree
energy: -1666.029736872335
dipole: -7.25071 6.57438 -0.67634 -15.76016 13.99249 -1.76767 -7.03707 5.38945 -1.64762
magnitude: 2.50933 au
magnitude: 6.37820 debye
