program: Orca
programVersion: 4.2.1
elementType: S O O O O O N N N N C C C C C C C C C C C C C C C H H H H H H H H H H H H H H H H
charge: 0
multiplicity: 1
keywords: wb97x-d3
keywords: def2-TZVPP
keywords: def2/J RIJCOSX GRIDX6 NOFINALGRIDX
keywords: grid4 nofinalgrid
keywords: scfconv7
keywords: smallprint printgap noloewdin
keywords: NOSOSCF
formula: C15H16N4O5S
InChI: InChI=1S/C15H16N4O5S/c1-9-8-10(2)17-14(16-9)18-15(21)19-25(22,23)12-7-5-4-6-11(12)13(20)24-3/h4-8,18-19H,1-3H3
41 atoms
S  -1.596694 0.296399 1.540482
O  -2.194507 1.252368 2.447353
O  -1.44871 -1.089462 1.947972
O  -1.892687 -2.965613 -0.569014
O  -0.580161 2.917478 0.604625
O  -0.12476 -1.617698 -0.819698
N  -0.053704 0.773575 1.164366
N  1.512802 2.177603 0.19477
N  3.614023 1.728307 -0.566447
N  2.36655 0.03778 0.514494
C  -2.481164 0.332613 0.006963
C  -2.316456 -0.700879 -0.915553
C  -3.376691 1.364985 -0.221816
C  -3.065245 -0.677102 -2.082709
C  -4.108826 1.379837 -1.399706
C  -3.95067 0.363798 -2.327112
C  0.230302 2.013423 0.652682
C  -1.312903 -1.796766 -0.742578
C  2.537676 1.259665 0.04992
C  4.610994 0.8707 -0.749593
C  3.355761 -0.840349 0.323108
C  4.514724 -0.450857 -0.317738
C  5.839677 1.356938 -1.43795
C  3.140472 -2.220605 0.836911
C  -1.032466 -4.102176 -0.420074
H  -3.517529 2.149063 0.507237
H  -2.95189 -1.466737 -2.813173
H  -4.806032 2.18464 -1.584668
H  -4.521253 0.372998 -3.245344
H  1.709782 3.100646 -0.168523
H  5.324066 -1.14805 -0.481291
H  6.700671 1.288126 -0.771641
H  6.061262 0.737652 -2.307742
H  5.733045 2.389174 -1.761542
H  3.934079 -2.894925 0.52409
H  3.106166 -2.214819 1.927487
H  2.184885 -2.611212 0.486179
H  -0.393919 -4.235753 -1.293013
H  -1.690301 -4.959479 -0.317764
H  -0.415984 -4.00926 0.474645
H  0.683098 0.050066 1.067685
elementType: S O N C H
totalener: -1574.74723458 hartree
nucrepener: 2509.49089678 hartree
electener: -4084.23813135 hartree
oneelecener: -7146.41252990 hartree
twoeener: 3062.17439854 hartree
cpcmener: -0.04925698 hartree
kineticenergy: 1569.08522026 hartree
xcener: -128.885033063490 hartree
chargesum: 0.0000000
charge: 0.889509 -0.507571 -0.519581 -0.271813 -0.490115 -0.426298 -0.209813 -0.134252 -0.391244 -0.383932 -0.120316 0.068596 -0.024619 -0.182290 -0.165611 -0.111907 0.381983 0.441909 0.395728 0.169710 0.173885 -0.172216 -0.237409 -0.231003 -0.125353 0.147468 0.150362 0.168983 0.169241 0.188197 0.143424 0.113620 0.110986 0.094527 0.100467 0.113673 0.093890 0.120671 0.138912 0.117560 0.212044
qa: 0.8895 -0.5076 -0.5196 -0.2718 -0.4901 -0.4263 -0.2098 -0.1343 -0.3912 -0.3839 -0.1203 0.0686 -0.0246 -0.1823 -0.1656 -0.1119 0.3820 0.4419 0.3957 0.1697 0.1739 -0.1722 -0.2374 -0.2310 -0.1254 0.1475 0.1504 0.1690 0.1692 0.1882 0.1434 0.1136 0.1110 0.0945 0.1005 0.1137 0.0939 0.1207 0.1389 0.1176 0.2120
va: 5.8101 1.9895 1.9667 2.1329 2.0221 2.0702 3.0568 3.1693 3.0403 3.0386 3.7622 3.7120 3.8586 4.0145 3.9477 3.8920 4.4050 4.0952 4.1543 3.9094 3.8390 3.9018 3.9161 3.9428 3.8510 1.0221 1.0045 0.9865 0.9853 1.0213 0.9955 0.9960 0.9962 1.0203 1.0083 0.9992 1.0096 0.9944 0.9937 0.9911 1.0810
dispcorr: -0.022185317 hartree
energy: -1574.769419892682
dipole: 16.01337 -13.77264 2.24072 -11.32060 9.11669 -2.20391 -9.57673 6.55649 -3.02023
magnitude: 4.35888 au
magnitude: 11.07940 debye
