program: Gaussian 09
title: 000069151
version: EM64L-G09RevD.01
frameworkgroup: C1[X(C9H13N)]
method: RPBEPBE
basis: SDD
operation: Freq
keyword: #pfreq=noraman
keyword: PBEPBE/SDD
title: #p freq=noraman PBEPBE/SDD
converged: YES YES NO NO
title: Mulliken charges:
elementType: N C C C C C C C C C H H H H H H H H H H H H H
charge: -0.000684 0.381264 0.335766 -0.546254 -0.551372 -0.336402 -0.493700 -0.676521 -0.678950 -0.345574 0.218363 0.216640 0.214276 0.215429 0.231264 0.245055 0.226954 0.221402 0.220186 0.228920 0.220769 0.216386 0.236782
chargesum: 0.00000
title: Mulliken charges with hydrogens summed into heavy atoms:
elementType: N C C C C C C C C C
charge: -0.000684 0.381264 0.335766 -0.111250 -0.121668 -0.105138 -0.248644 -0.007980 -0.012875 -0.108792
polarizability: 1.18999005e+02 2.09634774e+00 1.09658800e+02 1.06164155e+00 1.06966468e+01 6.92226257e+01
1716.lowfreq: -17.6546 -15.0753 -12.1474 0.0005 0.0007 0.0010 59.2500 77.6865 111.0569
frequency: 58.7194 77.2790 111.0480 142.7027 197.2485 213.4727 267.7674 321.9729 326.9517 388.3115 463.1322 538.9591 564.1515 609.8064 720.5708 775.3642 779.1211 785.1293 812.6848 844.2793 926.2076 962.2635 965.8538 971.2318 1020.8634 1041.4305 1054.5882 1062.1342 1074.3421 1169.0593 1193.5773 1229.9532 1243.5533 1252.4854 1305.9581 1311.0606 1315.1608 1324.5147 1388.0227 1388.9368 1403.3747 1464.8697 1466.7655 1471.7264 1472.9591 1483.4036 1487.9250 1493.8132 1556.0365 1579.2723 2981.4299 2982.1250 2992.7651 2998.1713 3040.7018 3049.2389 3078.9641 3081.0548 3085.2349 3087.0571 3105.7410 3120.1213 3145.4024
redmass: 2.1714 2.7436 3.4168 3.4175 1.1196 1.0849 2.7396 2.1492 3.0991 2.3674 3.3669 3.9636 4.0808 4.1755 3.6228 1.4605 2.5229 1.3475 2.6481 1.3070 1.4164 2.4579 1.4795 2.3647 1.9378 1.5825 1.9920 2.0399 1.5922 2.7937 1.6942 1.6581 1.2898 1.5686 1.5260 1.6124 2.0083 1.9128 1.1998 1.2128 1.9925 1.1125 1.8393 1.0438 1.0434 1.1268 1.0755 1.0956 6.7583 6.2621 1.0349 1.0348 1.0603 1.0611 1.1010 1.1001 1.1001 1.1003 1.1011 1.1009 1.0909 1.0872 1.0980
irintensity: 0.1726 0.0789 0.8119 0.1038 0.1127 0.0315 0.5268 0.1429 0.3503 0.5494 6.3666 2.3664 5.7663 3.4922 1.7482 2.4417 1.7315 5.5913 9.3845 36.7476 1.8309 6.6179 0.3475 0.9755 0.5110 0.6350 9.8068 19.2685 1.7639 0.2589 4.0011 2.1167 2.4950 0.9424 2.1737 1.3270 0.3697 0.4651 6.3707 12.8582 15.9328 6.9195 9.0457 17.4990 7.7842 8.1977 16.2982 5.5682 10.0440 21.3528 32.7073 32.5678 37.4424 22.4762 9.9881 6.3700 56.1332 47.6602 22.3931 52.2257 34.0492 6.7904 34.2997
temp: 298.150 k
press: 1.00000 atm
elementType: 7 6 6 6 6 6 6 6 6 6 1 1 1 1 1 1 1 1 1 1 1 1 1
symmnumber: 1
zpe: 519346.9 jmol-1
zpe.correction: 0.197809 hartree
zpe.thermalcorrener: 0.208076 hartree
zpe.thermalcorrenthalpy: 0.209020 hartree
zpe.thermalcorrgfe: 0.161931 hartree
zpe.sumelectzpe: -404.746925 hartree
zpe.sumelectthermal: -404.736658 hartree
zpe.sumelectthermalent: -404.735714 hartree
zpe.sumelectthermalfe: -404.782803 hartree
dipole: -3.1828 1.2681 0.4970
dipole: 3.4620
quadrupole: -66.5719 -56.7403 -62.7103
quadrupole: 4.9121 2.0967 2.3465
quadrupole: -4.5644 5.2672 -0.7028 4.9121 2.0967 2.3465
hfenergy: -404.9447335 hartree
pointgroup: C01 [X(C9H13N1)]
dipole: 1.2706823 0.4513692 -0.1918356 debye
dipolederiv: -0.4216322 -0.0098021 -0.0030897 0.0113334 -0.3326112 0.025098 -0.0008764 0.0388637 -0.2539626 0.2717012 0.1851775 0.0152586 0.2001308 0.1406583 -0.0517724 -0.0512543 -0.058901 -0.0530999 0.0574042 -0.3160045 0.0364287 -0.2375515 -0.0935182 0.0472592 0.0703233 0.0490563 -0.0613015 0.0075521 -0.1015553 -0.0161401 -0.1138154 0.05929 -0.0399474 -0.0973113 -0.1076672 0.0838035 0.036569 0.0916914 0.012444 0.0820081 0.0775217 -0.0316824 0.0934032 -0.0980398 0.0949733 -0.3112845 -0.0149113 -0.0244889 -0.0499779 0.0221647 -0.0570947 0.0155424 -0.0471273 -0.0910449 0.1018093 0.1825196 -0.0463012 -0.0255718 0.2484536 -0.1370733 0.0064255 -0.1325386 -0.0400344 0.0242212 -0.0355308 -0.022349 -0.0074911 0.0558304 -0.0316246 0.0592363 0.0184928 0.0106777 0.0244488 0.0386838 0.0203911 0.019317 0.0495667 -0.0368346 -0.0468584 0.0108768 0.0036574 0.3108029 -0.1258075 0.0657759 -0.0101227 0.118522 -0.087876 -0.0013085 -0.0854675 -0.0526181 -0.0677458 0.071508 0.0551624 0.0968008 -0.0196892 -0.0825176 0.0368652 -0.0484187 0.0364122 0.0423029 0.0274495 -0.0634146 -0.0231523 -0.0333552 0.11683 -0.0065258 0.0966995 -0.0735449 -0.0873098 -0.0573197 -0.0697091 -0.0869239 -0.0098485 -0.0871606 -0.049598 -0.0544565 0.0276382 0.046703 -0.0427209 0.0759095 0.0202441 -0.0442028 0.113302 0.0161035 0.0931278 -0.0626288 0.0918034 -0.0229518 0.0196945 0.0136763 -0.0957673 0.0912455 -0.0004233 0.0944058 0.1057328 0.0813344 0.0200115 -0.0160929 0.0185674 -0.103509 0.085628 -0.0113194 0.0903859 0.0857317 -0.0169271 0.1399806 0.0537622 0.0851147 -0.0182151 -0.0691394 0.0188563 -0.0374039 0.0535069 -0.1380956 -0.1602155 0.0156437 -0.148874 -0.0027649 -0.0058333 0.0160842 -0.00596 0.0664269 0.0900169 0.0105996 -0.0257508 0.0447258 -0.0088974 0.1347961 -0.0298808 0.0901339 -0.0596765 -0.0267878 -0.1348834 -0.0641293 -0.0801098 0.0022238 -0.0696184 -0.027079 -0.0400588 0.0469372 -0.1198673 0.1731084 -0.0162732 0.159518 -0.0253856 -0.0020831 -0.0176474 -0.0010464 0.0656632 0.0818532 -0.0212011 0.0389186 -0.0570803 -0.015006 0.1345941 0.0383648 0.0922839 -0.0527297 -0.0788724 0.1021741 -0.0416504 0.0892343 0.0285392 0.0415049 -0.0311222 0.0427593 0.1194804 unknown
polarizability: 118.8192046|-2.4972183|110.1580896|0.471788|-10.1019753|68.9031359 unknown
InChI: InChI=1S/C9H13N/c1-3-8-5-6-10-7-9(8)4-2/h5-7H,3-4H2,1-2H3
charge 0 multiplicity 1
23 atoms
N  -2.354137 -0.60702 0.279136
C  0.160801 0.668247 -0.262471
C  0.11646 -0.65942 0.260435
C  1.467265 1.410647 -0.506057
C  1.362729 -1.497798 0.508037
C  -1.076126 1.319778 -0.502489
C  -1.160872 -1.227892 0.509066
C  1.940139 2.181731 0.757773
C  1.827303 -2.254193 -0.767304
C  -2.292777 0.660088 -0.228451
H  2.262145 0.710913 -0.821551
H  1.330864 2.13168 -1.334033
H  2.190985 -0.867518 0.881556
H  1.149427 -2.238214 1.302462
H  -1.090264 2.339441 -0.905247
H  -1.230047 -2.244394 0.918809
H  1.182169 2.921076 1.072516
H  2.88521 2.718849 0.558496
H  2.107497 1.49346 1.606033
H  1.032226 -2.928998 -1.131332
H  2.727626 -2.860658 -0.559286
H  2.067916 -1.551155 -1.585511
H  -3.255538 1.14955 -0.415187
