program: Orca
programVersion: 4.2.1
elementType: S O O O O O N N N N C C C C C C C C C C C C C C C H H H H H H H H H H H H H H H H
charge: 0
multiplicity: 1
keywords: wb97x-d3
keywords: def2-TZVPP
keywords: def2/J RIJCOSX GRIDX6 NOFINALGRIDX
keywords: grid4 nofinalgrid
keywords: scfconv7
keywords: smallprint printgap noloewdin
keywords: NOSOSCF
formula: C15H16N4O5S
InChI: InChI=1S/C15H16N4O5S/c1-9-8-10(2)17-14(16-9)18-15(21)19-25(22,23)12-7-5-4-6-11(12)13(20)24-3/h4-8,18-19H,1-3H3
41 atoms
S  -1.394266 -0.058138 -1.735978
O  -1.228466 -1.495914 -1.832974
O  -1.864866 0.688599 -2.881613
O  -2.037227 -2.756447 1.259512
O  -0.486795 2.699863 -1.168898
O  -0.267325 -1.413829 1.010762
N  0.09946 0.504542 -1.286323
N  1.575583 2.098426 -0.478347
N  3.619175 1.855821 0.498425
N  2.471757 -0.041729 -0.312105
C  -2.464486 0.292384 -0.364029
C  -2.463933 -0.52414 0.768981
C  -3.367861 1.334558 -0.495451
C  -3.393007 -0.271704 1.769072
C  -4.275027 1.585181 0.523424
C  -4.287031 0.783523 1.6516
C  0.332318 1.822935 -0.994841
C  -1.455219 -1.602883 1.001399
C  2.594425 1.251921 -0.087904
C  4.611821 1.078805 0.910704
C  3.457632 -0.838662 0.107933
C  4.565847 -0.303812 0.735729
C  5.780627 1.730434 1.568811
C  3.289026 -2.297227 -0.140532
C  -1.185269 -3.86006 1.579647
H  -3.379737 1.945746 -1.385975
H  -3.414656 -0.891533 2.655508
H  -4.975693 2.402657 0.424106
H  -4.996023 0.972476 2.446231
H  1.733619 3.076539 -0.275174
H  5.372591 -0.934863 1.081397
H  5.976116 1.282759 2.543988
H  6.68186 1.591797 0.968799
H  5.614312 2.797229 1.700017
H  3.290854 -2.50045 -1.213259
H  4.082859 -2.881658 0.319759
H  2.328248 -2.637835 0.248597
H  -0.581105 -3.653696 2.462837
H  -0.533432 -4.109926 0.742623
H  -1.847453 -4.696572 1.782883
H  0.824269 -0.177889 -1.003429
elementType: S O N C H
totalener: -1574.75166190 hartree
nucrepener: 2498.87680134 hartree
electener: -4073.62846324 hartree
oneelecener: -7125.08904966 hartree
twoeener: 3051.46058642 hartree
cpcmener: -0.04016293 hartree
kineticenergy: 1569.08662691 hartree
xcener: -128.883217562129 hartree
chargesum: 0.0000000
charge: 0.883149 -0.512085 -0.495735 -0.271590 -0.465546 -0.415843 -0.204702 -0.139406 -0.386927 -0.382908 -0.136329 0.068815 -0.006864 -0.192899 -0.167861 -0.107299 0.368211 0.446034 0.394836 0.166841 0.172036 -0.177160 -0.235966 -0.233054 -0.123131 0.145433 0.146941 0.165048 0.164855 0.185200 0.140579 0.108922 0.111745 0.095636 0.111396 0.097714 0.099302 0.117268 0.117868 0.134647 0.212829
qa: 0.8831 -0.5121 -0.4957 -0.2716 -0.4655 -0.4158 -0.2047 -0.1394 -0.3869 -0.3829 -0.1363 0.0688 -0.0069 -0.1929 -0.1679 -0.1073 0.3682 0.4460 0.3948 0.1668 0.1720 -0.1772 -0.2360 -0.2331 -0.1231 0.1454 0.1469 0.1650 0.1649 0.1852 0.1406 0.1089 0.1117 0.0956 0.1114 0.0977 0.0993 0.1173 0.1179 0.1346 0.2128
va: 5.8277 1.9783 2.0052 2.1371 2.0533 2.0818 3.0596 3.1634 3.0417 3.0397 3.7872 3.6874 3.8476 4.0278 3.9557 3.9002 4.4205 4.0973 4.1559 3.9118 3.8455 3.9033 3.9135 3.9418 3.8574 1.0247 1.0102 0.9881 0.9871 1.0237 0.9969 0.9969 0.9963 1.0205 1.0000 1.0082 1.0090 0.9947 0.9916 0.9940 1.0756
dispcorr: -0.021641704 hartree
energy: -1574.773303599990
dipole: 14.87749 -13.10015 1.77734 -8.61681 7.26130 -1.35551 13.45756 -9.97650 3.48106
magnitude: 4.13693 au
magnitude: 10.51523 debye
