program: Gaussian 09
title: 000069149
version: EM64L-G09RevD.01
frameworkgroup: C1[X(C13H12N2O)]
method: RPBEPBE
basis: SDD
operation: Freq
keyword: #p
keyword: freq=noraman
keyword: PBEPBE/SDD
title: #p freq=noraman PBEPBE/SDD
converged: YES YES NO NO
title: Mulliken charges:
elementType: O N N C C C C C C C C C C C C C H H H H H H H H H H H H
charge: -0.218523 -0.684352 -0.698809 0.302779 0.293350 -0.054345 -0.315273 -0.353598 -0.344914 -0.353564 0.498501 0.484228 -0.424326 -0.409796 -0.415366 -0.409839 0.253884 0.238663 0.273136 0.238667 0.218760 0.215574 0.219940 0.215576 0.311623 0.310919 0.303549 0.303554
chargesum: 0.00000
title: Mulliken charges with hydrogens summed into heavy atoms:
elementType: O N N C C C C C C C C C C C C C
charge: -0.218523 -0.061809 -0.091706 0.302779 0.293350 -0.054345 -0.061389 -0.114935 -0.071778 -0.114897 0.498501 0.484228 -0.205566 -0.194222 -0.195426 -0.194263
polarizability: 2.54936933e+02 -1.74128484e-01 1.43875490e+02 -3.42133677e-02 -4.26071512e-02 1.06102787e+02
1716.lowfreq: -70.9882 -3.7773 -0.0006 -0.0006 -0.0005 2.4811 12.2692 47.0127 47.5086
frequency: -70.9832 46.9968 47.4586 88.1500 146.7388 160.0631 227.6657 278.2722 282.0865 333.9135 355.2074 364.4612 373.1721 383.3522 395.1323 411.0196 416.7964 421.5530 469.2060 509.2715 551.7835 577.4555 627.4137 631.2400 655.7828 697.5703 734.8187 767.4673 808.2588 813.6739 820.9511 824.9428 825.4924 847.2082 906.4359 938.9265 948.1372 967.6889 991.2697 997.0679 1003.3264 1016.3383 1019.2411 1127.4306 1128.3506 1151.0049 1184.8544 1192.3339 1288.0473 1305.8045 1306.2460 1311.5005 1326.9948 1368.2294 1387.7032 1425.2051 1446.6346 1510.5488 1516.5044 1534.2346 1572.4151 1574.6765 1628.9287 1629.2291 1641.7778 1645.4443 3114.2831 3115.9532 3118.8495 3121.3881 3138.9456 3144.2940 3151.2568 3155.5337 3559.6432 3568.1994 3699.8753 3708.7918
redmass: 4.3843 5.3888 3.7593 5.4661 4.9443 5.4025 5.3457 6.6028 4.6736 1.2519 5.6764 1.0609 2.7227 3.3857 2.5857 1.8589 1.3559 1.1826 4.4058 2.7927 3.9596 3.8208 6.6028 6.8459 5.6604 3.6069 3.8081 4.8174 3.7749 1.2626 4.1131 2.4290 1.2704 1.8625 4.3587 1.5595 1.3611 1.3568 1.3498 2.8357 2.6946 1.4423 1.4372 1.2395 1.2132 2.4083 1.1939 1.1878 2.8957 1.3451 1.4285 2.9800 3.1586 4.4527 4.3647 3.6391 4.4940 3.0150 3.3939 8.9208 6.7360 7.3964 3.1097 3.1507 1.5023 1.3811 1.0875 1.0872 1.0888 1.0885 1.0958 1.0971 1.0944 1.0959 1.0450 1.0448 1.1040 1.1040
irintensity: 0.8404 3.2111 1.2802 0.1795 0.7064 1.8203 3.2238 10.5321 5.0002 299.6216 8.6065 0.0315 0.5941 2.1749 1.9105 8.2179 208.4641 99.7012 4.0665 2.9514 7.6735 56.7364 1.6242 0.5260 0.5796 6.8903 0.0254 11.0239 20.9484 0.1045 24.7141 58.4033 1.4031 68.3237 51.1852 4.4591 0.0311 0.2058 0.4942 0.1838 0.2262 0.1736 1.1202 16.5820 17.7492 69.7328 134.4490 4.2246 283.2416 2.1457 2.3710 124.0770 202.5594 8.2405 23.2965 0.5057 20.5075 41.7205 26.5719 272.9613 4.0768 65.1586 116.0394 77.9920 398.4420 228.5634 5.0212 34.1484 15.2421 23.1126 34.5534 2.5828 14.8800 6.0960 120.1192 70.5737 23.1256 19.8017
temp: 298.150 k
press: 1.00000 atm
elementType: 8 7 7 6 6 6 6 6 6 6 6 6 6 6 6 6 1 1 1 1 1 1 1 1 1 1 1 1
symmnumber: 1
zpe: 577103.2 jmol-1
zpe.correction: 0.219807 hartree
zpe.thermalcorrener: 0.233264 hartree
zpe.thermalcorrenthalpy: 0.234208 hartree
zpe.thermalcorrgfe: 0.179654 hartree
zpe.sumelectzpe: -686.203644 hartree
zpe.sumelectthermal: -686.190187 hartree
zpe.sumelectthermalent: -686.189242 hartree
zpe.sumelectthermalfe: -686.243796 hartree
dipole: -1.4472 -6.0046 -0.0056
dipole: 6.1765
quadrupole: -43.6948 -97.9520 -90.0600
quadrupole: -2.3636 -0.0148 -0.0304
quadrupole: 33.5408 -20.7164 -12.8244 -2.3636 -0.0148 -0.0304
hfenergy: -686.4234506 hartree
pointgroup: C01 [X(C13H12N2O1)]
dipole: 0.5885887 2.3576689 0.0019682 debye
polarizability: 254.9267343|-1.0776325|143.8854151|0.0586089|0.1072113|106.1030609 unknown
InChI: InChI=1S/C13H12N2O/c14-11-5-1-9(2-6-11)13(16)10-3-7-12(15)8-4-10/h1-8H,14-15H2
charge 0 multiplicity 1
28 atoms
O  0.054202 -2.647366 -0.002418
N  4.986187 1.54915 0.001353
N  -5.050965 1.348206 0.000251
C  1.312058 -0.590163 -0.00047
C  -1.2691 -0.619277 -0.000853
C  0.046837 -1.374055 -0.001165
C  1.328026 0.833727 0.000419
C  -1.915324 -0.28527 -1.217399
C  2.56144 -1.277339 -0.000716
C  -1.91294 -0.282049 1.21607
C  3.784294 0.850952 0.000783
C  -3.810811 0.704137 -0.000112
C  2.537123 1.546315 0.001032
C  -3.163985 0.366878 -1.224701
C  3.774644 -0.579928 -0.0001
C  -3.161629 0.370039 1.224096
H  0.377606 1.378387 0.000567
H  -1.439789 -0.543446 -2.170879
H  2.542006 -2.372671 -0.001396
H  -1.43553 -0.537673 2.169304
H  2.529946 2.64329 0.001691
H  -3.645984 0.611825 -2.179408
H  4.725919 -1.126695 -0.000305
H  -3.641806 0.617421 2.179093
H  5.875061 1.056769 0.001325
H  4.999294 2.565239 0.002109
H  -5.519856 1.573661 0.8722
H  -5.521525 1.571433 -0.871372
