program: Orca
programVersion: 4.2.1
elementType: S O O O O O N N N N C C C C C C C C C C C C C C C H H H H H H H H H H H H H H H H
charge: 0
multiplicity: 1
keywords: wb97x-d3
keywords: def2-TZVPP
keywords: def2/J RIJCOSX GRIDX6 NOFINALGRIDX
keywords: grid4 nofinalgrid
keywords: scfconv7
keywords: smallprint printgap noloewdin
keywords: NOSOSCF
formula: C15H16N4O5S
InChI: InChI=1S/C15H16N4O5S/c1-9-8-10(2)17-14(16-9)18-15(21)19-25(22,23)12-7-5-4-6-11(12)13(20)24-3/h4-8,18-19H,1-3H3
41 atoms
S  -1.542336 0.330637 1.535211
O  -2.104399 1.339766 2.394192
O  -1.388883 -1.036644 1.984591
O  -2.082888 -3.077845 -0.539571
O  -0.531182 2.897759 0.383979
O  -0.262096 -1.785177 -0.672116
N  -0.008836 0.782393 1.061667
N  1.587204 2.179336 0.108614
N  3.733417 1.79156 -0.536549
N  2.460568 0.048933 0.428694
C  -2.474173 0.309844 0.018997
C  -2.424604 -0.794438 -0.83018
C  -3.320895 1.375079 -0.239626
C  -3.258795 -0.817443 -1.939545
C  -4.126679 1.348399 -1.367275
C  -4.098835 0.25182 -2.211701
C  0.270537 2.008443 0.517161
C  -1.454328 -1.918739 -0.647258
C  2.63013 1.289519 0.006759
C  4.754037 0.961839 -0.681647
C  3.473559 -0.799375 0.268917
C  4.663058 -0.374176 -0.294692
C  6.013267 1.51841 -1.263794
C  3.243144 -2.202032 0.722583
C  -1.268965 -4.228502 -0.347159
H  -3.351574 2.215698 0.437948
H  -3.247897 -1.672792 -2.601823
H  -4.782672 2.182229 -1.576066
H  -4.736299 0.221785 -3.085131
H  1.780188 3.095585 -0.267264
H  5.492535 -1.053439 -0.431779
H  6.517434 0.790419 -1.898172
H  5.805541 2.415267 -1.842353
H  6.706211 1.789999 -0.46482
H  2.330424 -2.590657 0.270909
H  4.075586 -2.854201 0.46712
H  3.102873 -2.229747 1.803991
H  -0.692867 -4.148965 0.574534
H  -0.585461 -4.384234 -1.182076
H  -1.953464 -5.068695 -0.275454
H  0.710673 0.050797 0.996188
totalener: -1574.72212476 hartree
nucrepener: 2491.61844400 hartree
electener: -4066.34056876 hartree
oneelecener: -7109.23478125 hartree
twoeener: 3042.89421250 hartree
kineticenergy: 1569.12315088 hartree
xcener: -128.880077119476 hartree
chargesum: -0.0000000
charge: 0.864507 -0.430378 -0.468232 -0.252807 -0.381061 -0.375213 -0.213377 -0.163401 -0.352036 -0.373978 -0.189092 0.104231 0.024403 -0.181216 -0.143199 -0.095727 0.345732 0.401020 0.388691 0.141945 0.164676 -0.159311 -0.235902 -0.231940 -0.142696 0.139400 0.118359 0.134360 0.132255 0.166801 0.109796 0.090724 0.104286 0.103017 0.107354 0.082560 0.105068 0.118794 0.108193 0.124447 0.208946
qa: 0.8645 -0.4304 -0.4682 -0.2528 -0.3811 -0.3752 -0.2134 -0.1634 -0.3520 -0.3740 -0.1891 0.1042 0.0244 -0.1812 -0.1432 -0.0957 0.3457 0.4010 0.3887 0.1419 0.1647 -0.1593 -0.2359 -0.2319 -0.1427 0.1394 0.1184 0.1344 0.1323 0.1668 0.1098 0.0907 0.1043 0.1030 0.1074 0.0826 0.1051 0.1188 0.1082 0.1244 0.2089
va: 5.8475 2.0829 2.0253 2.1383 2.1358 2.1224 3.0845 3.1542 3.0509 3.0478 3.9249 3.6878 3.8806 4.0615 3.9747 3.9384 4.4099 4.1386 4.1527 3.9418 3.8873 3.9179 3.9206 3.9463 3.8910 1.0284 1.0181 0.9990 0.9981 1.0384 1.0050 1.0028 1.0175 0.9989 1.0113 1.0095 1.0028 0.9931 0.9931 0.9958 1.0681
dispcorr: -0.021530656 hartree
energy: -1574.743655411924
dipole: 15.84228 -14.38052 1.46176 -11.17699 9.71044 -1.46654 -9.00475 7.14211 -1.86264
magnitude: 2.78512 au
magnitude: 7.07922 debye
