program: Orca
programVersion: 4.2.1
elementType: S F F F O O O O O O O N N N N N C C C C C C C C C C C C C C C H H H H H H H H H H H H H H
charge: 0
multiplicity: 1
keywords: wb97x-d3
keywords: def2-TZVPP
keywords: def2/J RIJCOSX GRIDX6 NOFINALGRIDX
keywords: grid4 nofinalgrid
keywords: scfconv7
keywords: smallprint printgap noloewdin
keywords: NOSOSCF
formula: C15H14F3N5O7S
InChI: InChI=1S/C15H14F3N5O7S/c1-28-9-6-10(29-2)21-13(20-9)22-14(25)23-31(26,27)11-7(12(24)30-3)4-5-8(19-11)15(16,17)18/h4-6,22-23H,1-3H3
45 atoms
S  -1.782508 0.831808 1.30074
F  1.315474 -1.313883 -1.930066
F  1.319773 -3.042741 -0.65306
F  0.559377 -3.194216 -2.661237
O  -2.9434 1.654118 1.03992
O  -1.427293 0.455798 2.653362
O  -4.238313 -0.73805 1.951646
O  -5.442466 -0.79179 0.059587
O  -1.280002 1.931147 -1.384207
O  5.492394 1.691144 -1.519824
O  3.456678 0.748183 2.54284
N  -0.76139 -1.021708 -0.239265
N  -0.42432 1.559238 0.694112
N  0.959048 1.998924 -1.124567
N  3.218336 1.83911 -1.33119
N  2.192312 1.357587 0.737716
C  -1.904495 -0.648164 0.272826
C  -3.117601 -1.270177 0.006199
C  -0.74741 -2.036684 -1.085226
C  -3.095051 -2.312198 -0.908167
C  -1.891856 -2.709789 -1.469344
C  -4.402566 -0.8932 0.657156
C  0.622131 -2.400651 -1.59356
C  -0.317198 1.828911 -0.655149
C  2.174166 1.711172 -0.535575
C  4.399646 1.585284 -0.784057
C  3.383481 1.105011 1.272369
C  4.555482 1.206417 0.544179
C  -5.361518 -0.288474 2.718708
C  5.374323 2.062242 -2.891791
C  2.253208 0.635981 3.300008
H  -4.009383 -2.824117 -1.174083
H  -1.870006 -3.520539 -2.181942
H  1.007796 2.241256 -2.10574
H  5.523913 1.007854 0.978827
H  -5.008351 -0.210053 3.741027
H  -5.704073 0.685512 2.37483
H  -6.179287 -1.004585 2.670562
H  4.789013 1.336804 -3.455686
H  6.389852 2.078323 -3.277242
H  4.932492 3.051366 -3.006256
H  1.71753 1.584041 3.350428
H  1.600172 -0.141407 2.902577
H  2.562643 0.354225 4.302334
H  0.467985 1.351513 1.172314
elementType: S F O N C H
totalener: -2078.34572319 hartree
nucrepener: 3655.04205660 hartree
electener: -5733.38777979 hartree
twoeener: 4396.17701070 hartree
cpcmener: -0.05238746 hartree
kineticenergy: 2071.22174582 hartree
xcener: -168.055757973796 hartree
chargesum: -0.0000000
charge: 0.893300 -0.164797 -0.172123 -0.170799 -0.487470 -0.506822 -0.262467 -0.438887 -0.461088 -0.299118 -0.296384 -0.316265 -0.196905 -0.127048 -0.415760 -0.413531 0.086022 0.032369 0.110384 -0.085721 -0.097032 0.448900 0.519884 0.334866 0.355148 0.417287 0.418955 -0.318938 -0.126842 -0.114728 -0.122870 0.161691 0.159265 0.194953 0.147902 0.132992 0.124710 0.129086 0.114819 0.132958 0.114273 0.118075 0.106784 0.140049 0.200922
qa: 0.8933 -0.1648 -0.1721 -0.1708 -0.4875 -0.5068 -0.2625 -0.4389 -0.4611 -0.2991 -0.2964 -0.3163 -0.1969 -0.1270 -0.4158 -0.4135 0.0860 0.0324 0.1104 -0.0857 -0.0970 0.4489 0.5199 0.3349 0.3551 0.4173 0.4190 -0.3189 -0.1268 -0.1147 -0.1229 0.1617 0.1593 0.1950 0.1479 0.1330 0.1247 0.1291 0.1148 0.1330 0.1143 0.1181 0.1068 0.1400 0.2009
va: 5.7570 1.1343 1.1302 1.1385 1.9942 1.9723 2.1423 2.0656 2.0425 2.1226 2.1324 3.0570 3.0978 3.1976 2.9601 2.9792 3.9596 3.7145 3.8952 4.0173 3.9875 4.1290 4.4572 4.4416 4.2389 4.0206 3.9845 3.9294 3.8430 3.8456 3.8401 1.0025 1.0017 1.0147 1.0156 0.9942 0.9946 0.9934 0.9954 0.9932 0.9956 0.9899 0.9992 0.9958 1.0901
dispcorr: -0.025999461 hartree
energy: -2078.371722646998
dipole: 2.78443 -0.95444 1.82999 12.25524 -14.02395 -1.76871 10.74306 -11.02851 -0.28546
magnitude: 2.56100 au
magnitude: 6.50953 debye
