program: Gaussian 09
title: 000074148
version: EM64L-G09RevD.01
frameworkgroup: C1[X(C12H14)]
method: RPBEPBE
basis: SDD
operation: Freq
keyword: #p
keyword: freq=noraman
keyword: PBEPBE/SDD
title: #p freq=noraman PBEPBE/SDD
converged: YES YES NO NO
title: Mulliken charges:
elementType: C C C C C C C C C C C C H H H H H H H H H H H H H H
charge: 0.362912 0.362912 -0.389115 -0.389115 -0.412668 -0.412669 0.386895 0.386894 -0.818070 -0.818069 -0.702070 -0.702070 0.217844 0.217844 0.236410 0.236409 0.232075 0.226913 0.227528 0.232075 0.226913 0.227528 0.216231 0.215116 0.216231 0.215116
chargesum: 0.00000
title: Mulliken charges with hydrogens summed into heavy atoms:
elementType: C C C C C C C C C C C C
charge: 0.362912 0.362912 -0.171271 -0.171271 -0.176258 -0.176259 0.386895 0.386894 -0.131554 -0.131553 -0.270723 -0.270723
polarizability: 2.29815867e+02 8.64394118e-05 1.35281829e+02 5.48917340e+00 5.22678455e-05 6.39736577e+01
1716.lowfreq: -4.5618 -3.3795 -0.0007 -0.0007 -0.0004 15.1959 26.2499 29.7266 74.3549
frequency: 26.1031 29.4265 74.3454 158.0898 219.7585 232.9137 235.7686 272.8372 294.8899 400.8684 403.0731 426.2059 432.0098 482.8964 505.1415 529.4385 552.0036 633.4339 643.0699 656.8532 699.6493 772.0999 777.2576 833.3327 855.7097 925.4511 925.9620 928.9580 930.3235 963.8960 974.1923 1000.6706 1003.7668 1008.5854 1050.0375 1050.0898 1102.3064 1133.1834 1141.9077 1215.6063 1303.5521 1310.5280 1322.7169 1356.5815 1394.1948 1396.3146 1422.5514 1426.5882 1430.5565 1470.5386 1470.7950 1483.8876 1484.6401 1512.8070 1556.6963 1616.4201 1638.5738 1642.4179 2973.3429 2973.5002 3050.0463 3050.0944 3093.0969 3093.3704 3104.0115 3104.1575 3132.6627 3139.5103 3154.8800 3163.5087 3202.2128 3202.4298
redmass: 2.8293 3.0997 3.9145 3.4398 2.4399 1.0794 1.2539 2.9302 3.8102 2.7671 3.1303 2.6321 3.5842 3.1001 2.5441 2.6167 1.7042 5.1003 4.5012 1.2911 1.1346 5.1272 2.4599 1.3091 1.6925 1.7171 1.3774 2.1269 1.5496 1.3821 1.3857 1.3636 2.2028 1.6491 1.5217 1.5175 2.8350 1.9787 1.4492 1.1356 2.1501 3.5097 1.5247 4.9101 1.2961 1.2224 3.2923 1.2728 1.2860 1.0499 1.0482 1.0888 1.0632 2.3716 5.2016 5.7866 4.4008 4.6118 1.0379 1.0378 1.0971 1.0971 1.0982 1.0981 1.0626 1.0623 1.0859 1.0864 1.0953 1.0957 1.1135 1.1134
irintensity: 0.0007 0.1067 0.7256 0.0827 0.0275 2.5446 0.1362 1.1592 0.0178 0.0000 13.4520 3.7202 0.0822 9.7914 0.4009 0.3520 1.3261 0.3060 0.0144 0.0358 9.5004 0.1175 0.0195 2.7150 61.2444 55.7465 5.0381 0.7126 88.3976 0.0500 0.2236 4.0241 3.2511 0.9601 6.6882 0.7658 0.0773 8.7479 6.2882 0.3836 46.1130 0.5873 17.6569 2.9411 27.3849 19.8437 12.8005 0.3975 0.3234 29.6012 0.9352 50.6070 1.3254 10.4195 12.9297 1.1204 30.0282 9.1818 5.7282 41.2900 0.7650 44.8223 61.5872 1.0253 3.0198 7.5180 8.3834 11.7467 30.1128 6.7545 32.5663 11.8259
temp: 298.150 k
press: 1.00000 atm
elementType: 6 6 6 6 6 6 6 6 6 6 6 6 1 1 1 1 1 1 1 1 1 1 1 1 1 1
symmnumber: 1
zpe: 575280.0 jmol-1
zpe.correction: 0.219113 hartree
zpe.thermalcorrener: 0.231057 hartree
zpe.thermalcorrenthalpy: 0.232001 hartree
zpe.thermalcorrgfe: 0.180094 hartree
zpe.sumelectzpe: -464.773856 hartree
zpe.sumelectthermal: -464.761912 hartree
zpe.sumelectthermalent: -464.760968 hartree
zpe.sumelectthermalfe: -464.812875 hartree
dipole: 0.0000 -0.7435 0.0000
dipole: 0.7435
quadrupole: -65.2871 -65.0314 -78.8185
quadrupole: 0.0000 -0.3496 0.0000
quadrupole: 4.4252 4.6809 -9.1061 0.0000 -0.3496 0.0000
hfenergy: -464.9929684 hartree
pointgroup: C01 [X(C12H14)]
dipole: 0.0000031 -0.2925071 -0.0000106 debye
dipolederiv: 0.1078399 -0.0934158 0.0196532 -0.1499377 -0.0850696 0.0214622 0.0748125 0.0026721 0.0107397 0.107836 0.0934175 0.0196572 0.1499379 -0.0850645 -0.021466 0.0748211 -0.0026738 0.0107388 -0.1327873 -0.0556301 -0.0079702 -0.105054 0.0596859 0.0075967 -0.0230345 0.0031332 -0.1415435 -0.1327898 0.0556273 -0.0079701 0.1050523 0.059689 -0.0075957 -0.0230358 -0.0031309 -0.1415434 -0.0846411 0.0652929 -0.0058857 0.1920432 0.0495435 -0.0048022 0.0022494 0.0029106 -0.1667761 -0.084637 -0.0652956 -0.0058872 -0.1920459 0.0495411 0.0048061 0.0022461 -0.002908 -0.1667758 0.4594343 0.060393 -0.0106337 0.1796198 0.2861703 -0.0691199 -0.0836534 -0.0377723 -0.0219204 0.4594372 -0.0603894 -0.0106375 -0.1796128 0.2861618 0.0691325 -0.0836588 0.0377836 -0.0219169 -0.0721903 -0.0656949 0.0089214 -0.0924605 -0.1054759 0.0333883 0.025676 0.0174128 0.0820185 -0.0721929 0.0656951 0.008924 0.0924583 -0.1054712 -0.033395 0.0256808 -0.0174189 0.0820168 -0.2794324 0.1079739 -0.0347208 0.1153113 -0.1680658 -0.062557 -0.034941 -0.0574402 -0.4054603 -0.279428 -0.1079738 -0.0347296 -0.1153101 -0.1680741 0.0625639 -0.0349554 0.0574435 -0.4054567 0.0295614 0.1030371 0.0064158 0.0792401 -0.047798 -0.0061047 0.0126357 0.0011568 0.1377521 0.0295641 -0.1030363 0.0064146 -0.0792394 -0.0478014 0.0061031 0.012635 -0.0011589 0.1377518 0.0509337 -0.0914338 -0.0012701 -0.1115445 -0.0595843 0.0027938 -0.0059202 -0.0004102 0.1402483 0.0509289 0.0914361 -0.001269 0.1115468 -0.0595816 -0.0027969 -0.0059198 0.0004072 0.1402483 0.0842557 0.034608 -0.0931023 0.0098326 0.0160613 0.0787758 -0.0542848 0.097132 -0.0663134 0.1055779 0.0441585 0.065852 0.0103134 -0.050538 -0.0868132 0.0342559 -0.1104526 -0.0235473 -0.1843631 -0.0285522 0.0233588 0.0818914 0.0856849 0.0004858 0.0017543 0.008459 0.1054212 0.0842552 -0.0346037 -0.0931023 -0.0098304 0.016067 -0.0787748 -0.0542841 -0.0971303 -0.0663175 0.1055807 -0.0441561 0.0658478 -0.0103098 -0.0505459 0.0868137 0.0342513 0.1104532 -0.023542 -0.1843619 0.0285454 0.0233618 -0.0818965 0.0856837 -0.0004857 0.001754 -0.0084602 0.1054205 -0.1460049 0.0023192 0.0061864 -0.0337659 0.0874224 0.0215973 0.0322026 0.0158559 0.1745634 0.0618165 -0.1002009 0.0231956 -0.0914465 -0.0680362 0.0597077 0.0182486 0.0557055 0.1748177 -0.1460053 -0.0023246 0.0061888 0.0337584 0.0874243 -0.0216003 0.0322104 -0.015857 0.1745625 0.0618126 0.100203 0.0232011 0.0914486 -0.0680285 -0.0597155 0.0182542 -0.0557118 0.1748136 unknown
polarizability: 229.9564822|0.0007296|135.2818295|2.6060246|0.0008682|63.8330428 unknown
InChI: InChI=1S/C12H14/c1-9(2)11-5-7-12(8-6-11)10(3)4/h5-8H,1,3H2,2,4H3
charge 0 multiplicity 1
26 atoms
C  -1.451394 0.067668 0.018937
C  1.451422 0.067692 -0.018942
C  -0.700949 1.282191 0.011632
C  0.700957 1.282202 -0.011622
C  -0.70488 -1.141968 0.012302
C  0.704928 -1.141956 -0.012326
C  -2.945091 0.051762 0.036443
C  2.945119 0.051814 -0.036448
C  -3.636282 -1.28085 0.292189
C  3.636337 -1.280774 -0.292247
C  -3.699396 1.171052 -0.176066
C  3.6994 1.171113 0.176095
H  -1.224766 2.243556 0.033373
H  1.224759 2.243577 -0.033352
H  -1.227593 -2.103689 0.019448
H  1.227656 -2.103669 -0.019486
H  -3.29091 -1.741193 1.237129
H  -3.431189 -2.005553 -0.519393
H  -4.729133 -1.148613 0.35323
H  3.290967 -1.741094 -1.237198
H  3.431268 -2.005507 0.519314
H  4.729185 -1.14851 -0.353294
H  -4.793334 1.12744 -0.147618
H  -3.262504 2.150619 -0.396397
H  4.793338 1.127528 0.147637
H  3.262485 2.150663 0.396459
