program: Gaussian 09
title: 000069147
version: EM64L-G09RevD.01
frameworkgroup: C1[X(C14H10O3)]
method: RPBEPBE
basis: SDD
operation: Freq
keyword: #pfreq=noraman
keyword: PBEPBE/SDD
title: #p freq=noraman PBEPBE/SDD
converged: NO YES NO NO
title: Mulliken charges:
elementType: O O O C C C C C C C C C C C C C C H H H H H H H H H H
charge: -0.217332 -0.439386 -0.242210 0.314026 0.294558 0.010161 -0.360519 -0.355590 0.252375 -0.333206 -0.354552 -0.365680 -0.356388 -0.235206 -0.230292 -0.227652 0.112913 0.272578 0.277016 0.278139 0.275547 0.265685 0.273070 0.233898 0.235197 0.235355 0.387494
chargesum: 0.00000
title: Mulliken charges with hydrogens summed into heavy atoms:
elementType: O O O C C C C C C C C C C C C C C
charge: -0.217332 -0.051891 -0.242210 0.314026 0.294558 0.010161 -0.087940 -0.078574 0.252375 -0.055066 -0.079005 -0.099995 -0.083318 -0.001309 0.004904 0.007703 0.112913
polarizability: 2.60897161e+02 4.88075549e+00 1.55858082e+02 1.35082910e+01 4.50567076e-01 8.24699250e+01
1716.lowfreq: -5.3952 -0.0004 0.0004 0.0007 3.4835 7.2791 36.7486 52.4666 55.9405
frequency: 36.7215 52.4635 55.9315 83.3325 104.9527 158.5996 166.2529 234.0282 250.3791 254.4331 350.6324 401.0127 410.5846 412.9608 447.9647 454.8022 490.2890 562.3200 594.4115 612.8386 614.0810 628.8858 672.5338 681.2677 699.9328 707.1388 760.5709 769.7361 806.5704 859.4956 871.3952 885.3810 917.0459 948.9603 987.8724 988.8687 997.7862 1001.7632 1005.9698 1007.1544 1023.5604 1027.3927 1084.6396 1119.0590 1144.5023 1154.6434 1175.2530 1187.8771 1196.1297 1280.5252 1303.8055 1319.0334 1322.2933 1378.2221 1384.0372 1407.6881 1433.7181 1476.8870 1492.2587 1533.3194 1570.8446 1587.0631 1607.8508 1616.6452 1644.6496 3129.4151 3138.3025 3148.6793 3152.6711 3152.8652 3158.9155 3169.6582 3170.9617 3180.0959 3533.5143
redmass: 6.1651 5.1059 6.5656 5.4294 6.0350 6.2815 6.3608 6.5887 5.6926 6.1786 7.7146 2.8271 3.6370 3.4659 4.0892 5.6235 5.8928 3.9864 1.3980 4.7272 5.9989 6.7335 4.4376 5.2780 2.9072 1.6988 4.1218 3.5204 2.8775 1.2727 1.2593 1.8261 4.6835 1.4852 1.3874 5.9413 1.3686 4.4535 1.3652 1.3921 2.6754 2.1818 1.5849 1.3753 2.5538 2.0308 1.0578 1.1248 1.1849 3.6040 1.3763 1.3677 2.5846 6.1129 8.6038 3.7801 2.2659 2.2422 2.5688 10.0118 7.4032 6.4298 6.0420 6.2907 8.7876 1.0852 1.0881 1.0922 1.0887 1.0894 1.0961 1.1014 1.0968 1.0961 1.0642
irintensity: 0.0916 0.4812 0.3411 1.8002 1.5306 0.8210 1.8610 1.4447 3.4565 4.1946 1.0690 0.5495 7.0812 6.8005 15.1769 28.8375 2.4158 21.4614 88.1692 10.8613 2.4231 0.6847 25.0578 27.6075 24.5739 165.4374 9.4971 10.1721 6.5682 8.2299 2.2779 41.7585 60.0823 4.8954 4.4125 3.5279 2.8706 191.7217 2.0976 8.5310 71.5818 40.5404 8.5979 7.3730 48.8560 65.2353 0.2574 28.8085 2.9830 363.6910 35.0169 14.9915 66.0528 0.7243 2.0993 25.6856 17.4574 1.0309 19.2191 118.5416 45.4194 13.0743 19.7326 7.6047 296.8280 0.4710 4.9042 21.7916 0.5980 0.2479 17.5716 23.2814 1.7678 1.0120 53.0993
temp: 298.150 k
press: 1.00000 atm
elementType: 8 8 8 6 6 6 6 6 6 6 6 6 6 6 6 6 6 1 1 1 1 1 1 1 1 1 1
symmnumber: 1
zpe: 528476.1 jmol-1
zpe.correction: 0.201286 hartree
zpe.thermalcorrener: 0.215197 hartree
zpe.thermalcorrenthalpy: 0.216141 hartree
zpe.thermalcorrgfe: 0.159105 hartree
zpe.sumelectzpe: -764.004811 hartree
zpe.sumelectthermal: -763.990900 hartree
zpe.sumelectthermalent: -763.989956 hartree
zpe.sumelectthermalfe: -764.046992 hartree
dipole: -1.7092 -4.1444 -0.2638
dipole: 4.4907
quadrupole: -88.6551 -97.4565 -98.3899
quadrupole: -0.5144 -1.9612 -0.1528
quadrupole: 6.1788 -2.6227 -3.5561 -0.5144 -1.9612 -0.1528
hfenergy: -764.2060969 hartree
pointgroup: C01 [X(C14H10O3)]
dipole: -0.6272811 -1.2589889 -1.0691137 debye
polarizability: 260.9976338|0.3011383|128.4771249|12.6849152|35.9170711|109.7504092 unknown
InChI: InChI=1S/C14H10O3/c15-13(10-4-2-1-3-5-10)11-6-8-12(9-7-11)14(16)17/h1-9,16H
charge 0 multiplicity 1
27 atoms
O  -1.483716 2.030264 1.386303
O  4.656661 -0.90814 -1.404474
O  5.316511 0.087885 0.58774
C  0.20187 0.590585 0.462354
C  -2.357037 0.116928 0.218636
C  -1.233061 0.972157 0.726512
C  0.607483 -0.094874 -0.715019
C  1.188484 1.013647 1.394954
C  2.945135 0.040817 -0.002466
C  1.970844 -0.362442 -0.950642
C  2.5468 0.73311 1.17247
C  -2.227696 -1.285816 0.028028
C  -3.61837 0.734353 -0.004923
C  -3.338256 -2.052308 -0.38885
C  -4.719972 -0.028727 -0.437414
C  -4.582583 -1.425568 -0.631884
C  4.395066 -0.231508 -0.200776
H  -0.137891 -0.38795 -1.46079
H  0.863578 1.568068 2.280943
H  2.290955 -0.877314 -1.860383
H  3.31556 1.042519 1.887796
H  -1.274996 -1.783418 0.238388
H  -3.709542 1.811147 0.172504
H  -3.234647 -3.135058 -0.518787
H  -5.684759 0.457238 -0.618756
H  -5.441226 -2.020706 -0.96249
H  5.636905 -1.057689 -1.480574
