program: Orca
programVersion: 4.2.1
elementType: S F F F O O O O O O O N N N N N C C C C C C C C C C C C C C C H H H H H H H H H H H H H H
charge: 0
multiplicity: 1
keywords: wb97x-d3
keywords: def2-TZVPP
keywords: def2/J RIJCOSX GRIDX6 NOFINALGRIDX
keywords: grid4 nofinalgrid
keywords: scfconv7
keywords: smallprint printgap noloewdin
keywords: NOSOSCF
formula: C15H14F3N5O7S
InChI: InChI=1S/C15H14F3N5O7S/c1-28-9-6-10(29-2)21-13(20-9)22-14(25)23-31(26,27)11-7(12(24)30-3)4-5-8(19-11)15(16,17)18/h4-6,22-23H,1-3H3
45 atoms
S  -1.747686 0.758001 1.215706
F  0.9632 -1.539242 -2.406185
F  1.216749 -2.994904 -0.845331
F  0.249565 -3.551841 -2.68725
O  -2.864117 1.634763 0.943447
O  -1.401802 0.381921 2.570186
O  -4.201114 -0.666454 2.002127
O  -5.525841 -0.801336 0.19866
O  -1.150825 1.787145 -1.497126
O  5.627179 1.786804 -1.364816
O  3.475084 0.908886 2.653537
N  -0.872817 -1.142594 -0.374275
N  -0.353594 1.396094 0.599871
N  1.079116 1.874994 -1.163077
N  3.349045 1.839701 -1.262505
N  2.261592 1.380452 0.777424
C  -1.966967 -0.727341 0.206609
C  -3.215497 -1.312713 0.018949
C  -0.943694 -2.170629 -1.202611
C  -3.282257 -2.364932 -0.880163
C  -2.128892 -2.812727 -1.505042
C  -4.452086 -0.886329 0.73144
C  0.381118 -2.571134 -1.795329
C  -0.214047 1.691664 -0.738119
C  2.278034 1.689215 -0.507898
C  4.517343 1.662779 -0.662074
C  3.439933 1.212617 1.370317
C  4.636423 1.345928 0.686564
C  -5.255796 -0.141102 2.812891
C  5.531848 2.07329 -2.757674
C  2.248194 0.768018 3.365528
H  -4.228262 -2.848285 -1.083088
H  -2.176412 -3.635275 -2.203152
H  1.163652 2.108696 -2.143968
H  5.59418 1.208211 1.166699
H  -4.821179 0.020344 3.794478
H  -5.622993 0.805262 2.417471
H  -6.07894 -0.850219 2.892009
H  4.987263 1.29514 -3.292723
H  6.556095 2.106343 -3.11977
H  5.055537 3.036418 -2.941563
H  1.663863 1.688684 3.351643
H  1.650745 -0.058921 2.979165
H  2.528502 0.546357 4.391876
H  0.519887 1.230616 1.124098
elementType: S F O N C H
totalener: -2078.34842231 hartree
nucrepener: 3624.16978624 hartree
electener: -5702.51820855 hartree
twoeener: 4365.26435997 hartree
cpcmener: -0.04282018 hartree
kineticenergy: 2071.23487572 hartree
xcener: -168.056772215692 hartree
chargesum: 0.0000000
charge: 0.882248 -0.168157 -0.171723 -0.171898 -0.475253 -0.497473 -0.261862 -0.416400 -0.438769 -0.290928 -0.288513 -0.312652 -0.194671 -0.132424 -0.421500 -0.423963 0.088325 0.024059 0.100066 -0.084122 -0.099534 0.433419 0.525943 0.329751 0.364425 0.413780 0.418864 -0.320784 -0.126426 -0.115137 -0.124931 0.157902 0.157787 0.191030 0.145092 0.129856 0.123930 0.128110 0.113968 0.131332 0.113052 0.116940 0.108555 0.138487 0.200201
qa: 0.8822 -0.1682 -0.1717 -0.1719 -0.4753 -0.4975 -0.2619 -0.4164 -0.4388 -0.2909 -0.2885 -0.3127 -0.1947 -0.1324 -0.4215 -0.4240 0.0883 0.0241 0.1001 -0.0841 -0.0995 0.4334 0.5259 0.3298 0.3644 0.4138 0.4189 -0.3208 -0.1264 -0.1151 -0.1249 0.1579 0.1578 0.1910 0.1451 0.1299 0.1239 0.1281 0.1140 0.1313 0.1131 0.1169 0.1086 0.1385 0.2002
va: 5.7759 1.1350 1.1347 1.1368 2.0080 1.9838 2.1392 2.0930 2.0740 2.1324 2.1418 3.0606 3.0913 3.1916 2.9661 2.9798 3.9701 3.7045 3.9112 4.0155 3.9699 4.1502 4.4592 4.4488 4.2445 4.0274 3.9928 3.9286 3.8481 3.8488 3.8429 1.0049 1.0023 1.0178 1.0163 0.9951 0.9949 0.9927 0.9959 0.9934 0.9957 0.9913 0.9976 0.9953 1.0873
dispcorr: -0.025241613 hartree
energy: -2078.373663920259
dipole: 4.20805 -2.56284 1.64521 13.76505 -15.27419 -1.50914 12.61351 -12.65580 -0.04229
magnitude: 2.23294 au
magnitude: 5.67567 debye
