program: Gaussian 09
title: 000069146
version: EM64L-G09RevD.01
frameworkgroup: C1[X(C14H12O2)]
method: RPBEPBE
basis: SDD
operation: Freq
keyword: #pfreq=noraman
keyword: PBEPBE/SDD
title: #p freq=noraman PBEPBE/SDD
converged: YES YES NO NO
title: Mulliken charges:
elementType: O O C C C C C C C C C C C C C C H H H H H H H H H H H H
charge: -0.258884 -0.235867 0.294383 0.292343 0.010349 -0.364085 -0.338443 0.324124 -0.357526 -0.363849 -0.376198 -0.361871 -0.237127 -0.232336 -0.230955 -0.536788 0.271962 0.268727 0.244994 0.254755 0.267054 0.270392 0.230496 0.231523 0.231801 0.226806 0.225397 0.248823
chargesum: 0.00000
title: Mulliken charges with hydrogens summed into heavy atoms:
elementType: O O C C C C C C C C C C C C C C
charge: -0.258884 -0.235867 0.294383 0.292343 0.010349 -0.092123 -0.069716 0.324124 -0.112532 -0.109094 -0.109144 -0.091479 -0.006631 -0.000813 0.000846 0.164238
polarizability: 2.65250252e+02 -6.42491657e-01 1.48787564e+02 -1.10303428e+01 -1.34510717e+00 8.33638929e+01
1716.lowfreq: -2.9074 -0.0006 -0.0006 0.0004 6.0273 10.4038 38.3128 58.0229 78.0957
frequency: 38.2793 58.0006 78.0950 92.8796 129.3493 175.6732 189.5210 227.2078 238.3561 295.7119 301.7111 362.9469 404.6815 415.5347 421.0458 476.3279 503.3774 557.8442 585.4005 613.8745 628.4982 673.8771 687.0208 705.5114 746.8238 776.1301 798.5659 826.6821 847.8922 863.9856 914.7259 945.5107 969.2792 977.9437 982.6176 988.8808 991.8047 1002.5329 1003.6749 1027.1683 1083.2582 1111.9667 1115.2204 1152.4312 1157.8658 1173.6278 1177.5965 1190.2639 1238.9270 1285.9314 1305.6788 1319.3995 1370.3319 1382.4380 1425.7233 1432.5553 1436.7151 1468.6732 1471.9835 1476.7128 1497.8992 1527.6165 1572.2764 1587.3258 1607.2917 1617.7771 2967.0245 3058.5227 3126.6440 3130.4655 3136.7045 3146.8664 3147.5940 3149.8367 3157.8311 3167.6986 3168.1949 3172.2927
redmass: 3.9815 4.5570 4.0742 4.2415 5.2835 4.4624 3.8191 1.2566 4.5129 4.4338 4.7534 8.1211 2.8810 4.2167 3.0427 4.0278 3.3307 4.3622 6.0689 6.4574 6.9877 4.3585 5.0193 1.6347 2.8707 5.7548 2.3495 1.2809 1.7589 1.2828 5.2105 1.5083 1.3850 1.3722 7.6833 4.1376 1.5323 2.3662 1.4041 2.1663 1.5848 1.2595 1.3393 2.8679 1.3610 1.0585 1.2486 1.1450 3.1794 2.7890 1.4675 1.3585 5.2428 8.7012 3.9864 2.2428 1.2105 1.0499 1.0778 2.2097 2.5206 10.0576 7.0678 6.3306 6.0000 6.4516 1.0326 1.1043 1.0850 1.1000 1.0881 1.0901 1.0878 1.0906 1.0960 1.0955 1.1011 1.0969
irintensity: 2.8729 1.2101 1.3579 0.6920 8.5086 4.5141 0.6139 0.6285 0.7443 3.4431 2.5832 2.1510 0.6497 2.0895 0.2441 4.5062 8.0644 9.6772 44.6389 0.8352 1.8319 19.8901 7.1059 73.3870 42.0915 4.9657 12.5984 4.3552 55.9855 7.0115 60.5099 4.7819 4.5929 5.7329 49.5309 2.2211 0.0462 2.4237 0.5280 5.0833 12.0099 0.2083 13.6748 14.5170 12.1092 4.3330 178.9544 0.3367 189.0537 338.3817 79.0243 19.9001 42.7305 1.7525 0.0843 13.2785 7.0724 14.9049 57.1766 1.7075 21.2320 155.7178 34.7403 22.9329 52.6473 182.7250 72.2550 42.8579 0.3888 23.3660 6.7414 22.7808 1.7221 4.2202 18.9761 12.1107 27.0833 4.4038
temp: 298.150 k
press: 1.00000 atm
elementType: 8 8 6 6 6 6 6 6 6 6 6 6 6 6 6 6 1 1 1 1 1 1 1 1 1 1 1 1
symmnumber: 1
zpe: 575655.6 jmol-1
zpe.correction: 0.219256 hartree
zpe.thermalcorrener: 0.232866 hartree
zpe.thermalcorrenthalpy: 0.233810 hartree
zpe.thermalcorrgfe: 0.178137 hartree
zpe.sumelectzpe: -690.004237 hartree
zpe.sumelectthermal: -689.990626 hartree
zpe.sumelectthermalent: -689.989682 hartree
zpe.sumelectthermalfe: -690.045355 hartree
dipole: -2.1468 -2.3604 0.5685
dipole: 3.2409
quadrupole: -63.3393 -97.2547 -94.6467
quadrupole: -10.6675 -6.1425 -1.0526
quadrupole: 21.7409 -12.1745 -9.5665 -10.6675 -6.1425 -1.0526
hfenergy: -690.2234925 hartree
pointgroup: C01 [X(C14H12O2)]
dipole: 0.8660982 -0.8411293 0.410098 debye
polarizability: 263.7521036|-9.2071281|120.6761754|-17.2259267|-31.9283595|112.9734297 unknown
InChI: InChI=1S/C14H12O2/c1-16-13-9-7-12(8-10-13)14(15)11-5-3-2-4-6-11/h2-10H,1H3
charge 0 multiplicity 1
28 atoms
O  4.458304 -0.730749 0.499193
O  -1.078966 1.662533 -1.753497
C  0.481742 0.304953 -0.529604
C  -2.103209 0.084509 -0.258441
C  -0.904286 0.736763 -0.894985
C  1.528425 0.559303 -1.454851
C  0.815952 -0.274858 0.729118
C  3.17391 -0.359889 0.093207
C  2.863328 0.225096 -1.163833
C  2.145621 -0.59877 1.041873
C  -2.117259 -1.281897 0.132105
C  -3.290933 0.85367 -0.127411
C  -3.294618 -1.861353 0.654718
C  -4.459418 0.279712 0.411274
C  -4.464126 -1.080781 0.805342
C  5.569388 -0.488563 -0.428659
H  1.268361 1.031558 -2.408114
H  0.036424 -0.437755 1.479984
H  3.644246 0.421622 -1.904136
H  2.41714 -1.027734 2.010959
H  -1.222573 -1.898084 -0.005625
H  -3.273394 1.895904 -0.463028
H  -3.301511 -2.919685 0.938138
H  -5.366384 0.884558 0.519825
H  -5.374593 -1.5301 1.217836
H  5.673734 0.589545 -0.65575
H  5.437391 -1.058128 -1.368425
H  6.464703 -0.845782 0.100186
