program: Orca
programVersion: 4.2.1
elementType: S F F F O O O O O O O N N N N N C C C C C C C C C C C C C C C H H H H H H H H H H H H H H
charge: 0
multiplicity: 1
keywords: wb97x-d3
keywords: def2-TZVPP
keywords: def2/J RIJCOSX GRIDX6 NOFINALGRIDX
keywords: grid4 nofinalgrid
keywords: scfconv7
keywords: smallprint printgap noloewdin
keywords: NOSOSCF
formula: C15H14F3N5O7S
InChI: InChI=1S/C15H14F3N5O7S/c1-28-9-6-10(29-2)21-13(20-9)22-14(25)23-31(26,27)11-7(12(24)30-3)4-5-8(19-11)15(16,17)18/h4-6,22-23H,1-3H3
45 atoms
S  -1.739341 1.16609 -0.730768
F  0.798684 -3.354669 -1.589816
F  1.364698 -2.6415 0.357577
F  0.348007 -4.53051 0.157457
O  -1.523478 1.365813 -2.147636
O  -2.783762 1.878543 -0.030257
O  -5.057166 -0.248296 1.016898
O  -4.883978 0.131214 -1.186493
O  -0.891082 0.820105 2.048535
O  5.830595 1.61952 1.554598
O  3.362608 2.275943 -2.322905
N  -0.858216 -1.283445 -0.472149
N  -0.270599 1.468901 -0.036875
N  1.296176 1.224826 1.659463
N  3.5589 1.42455 1.608399
N  2.311476 1.749366 -0.365216
C  -1.964313 -0.588215 -0.408276
C  -3.205067 -1.115089 -0.080836
C  -0.910479 -2.573347 -0.194461
C  -3.24273 -2.467155 0.227313
C  -2.078858 -3.216808 0.17257
C  -4.469145 -0.321796 -0.154152
C  0.410661 -3.285183 -0.313801
C  -0.018875 1.151766 1.276853
C  2.433973 1.481221 0.923215
C  4.670438 1.667045 0.927911
C  3.433048 1.996957 -1.035589
C  4.677207 1.972428 -0.428551
C  -6.291371 0.476551 1.086732
C  5.850018 1.285752 2.9400
C  2.086067 2.303848 -2.956816
H  -4.174782 -2.941158 0.503487
H  -2.103038 -4.269494 0.412827
H  1.458839 1.013786 2.63564
H  5.588802 2.173002 -0.972206
H  -6.156611 1.510127 0.769599
H  -7.061972 0.003122 0.47949
H  -6.587231 0.454876 2.131201
H  5.4499 0.287571 3.119389
H  5.294585 2.007802 3.538583
H  6.896574 1.308751 3.232268
H  2.278115 2.574853 -3.99159
H  1.603845 1.325594 -2.934951
H  1.430253 3.054066 -2.513719
H  0.546141 1.614779 -0.649543
elementType: S F O N C H
totalener: -2078.34816326 hartree
nucrepener: 3582.61733804 hartree
electener: -5660.96550129 hartree
oneelecener: -9985.20760735 hartree
twoeener: 4324.24210605 hartree
cpcmener: -0.04574765 hartree
kineticenergy: 2071.23643279 hartree
xcener: -168.055580294158 hartree
chargesum: -0.0000000
charge: 0.871447 -0.169603 -0.166149 -0.172441 -0.493558 -0.474912 -0.260326 -0.404345 -0.446971 -0.290827 -0.288027 -0.308702 -0.195810 -0.133841 -0.423891 -0.428290 0.073889 0.047453 0.100385 -0.099916 -0.090451 0.414189 0.513700 0.345813 0.367423 0.414284 0.419829 -0.319063 -0.124180 -0.115771 -0.126303 0.161704 0.157800 0.192385 0.145491 0.121385 0.123168 0.132935 0.113244 0.113812 0.131716 0.138568 0.111034 0.115639 0.206085
qa: 0.8714 -0.1696 -0.1661 -0.1724 -0.4936 -0.4749 -0.2603 -0.4043 -0.4470 -0.2908 -0.2880 -0.3087 -0.1958 -0.1338 -0.4239 -0.4283 0.0739 0.0475 0.1004 -0.0999 -0.0905 0.4142 0.5137 0.3458 0.3674 0.4143 0.4198 -0.3191 -0.1242 -0.1158 -0.1263 0.1617 0.1578 0.1924 0.1455 0.1214 0.1232 0.1329 0.1132 0.1138 0.1317 0.1386 0.1110 0.1156 0.2061
va: 5.7841 1.1343 1.1361 1.1349 1.9938 2.0142 2.1513 2.0987 2.0647 2.1326 2.1429 3.0791 3.0848 3.1890 2.9687 2.9778 3.9630 3.7178 3.9055 4.0318 3.9515 4.1908 4.4803 4.4283 4.2467 4.0265 3.9934 3.9285 3.8499 3.8488 3.8433 1.0007 1.0019 1.0166 1.0161 0.9945 0.9920 0.9937 0.9959 0.9955 0.9933 0.9957 0.9959 0.9916 1.0785
dispcorr: -0.024259177 hartree
energy: -2078.372422434035
dipole: 1.80084 -0.89353 0.90731 18.84764 -20.45398 -1.60634 6.36885 -4.70050 1.66835
magnitude: 2.48736 au
magnitude: 6.32236 debye
