program: Orca
programVersion: 4.2.1
elementType: S F F F O O O O O O O N N N N N C C C C C C C C C C C C C C C H H H H H H H H H H H H H H
charge: 0
multiplicity: 1
keywords: wb97x-d3
keywords: def2-TZVPP
keywords: def2/J RIJCOSX GRIDX6 NOFINALGRIDX
keywords: grid4 nofinalgrid
keywords: scfconv7
keywords: smallprint printgap noloewdin
keywords: NOSOSCF
formula: C15H14F3N5O7S
InChI: InChI=1S/C15H14F3N5O7S/c1-28-9-6-10(29-2)21-13(20-9)22-14(25)23-31(26,27)11-7(12(24)30-3)4-5-8(19-11)15(16,17)18/h4-6,22-23H,1-3H3
45 atoms
S  -1.776083 1.23671 -0.635578
F  0.868143 -3.181485 -1.687988
F  1.389241 -2.55359 0.300451
F  0.419932 -4.452148 -0.007739
O  -1.584211 1.529436 -2.040381
O  -2.822983 1.888273 0.119272
O  -5.06434 -0.313205 1.028514
O  -4.901676 0.167837 -1.154704
O  -0.882505 0.722294 2.103027
O  5.845117 1.313087 1.453047
O  3.28708 2.41161 -2.26254
N  -0.850777 -1.206944 -0.503295
N  -0.301632 1.516082 0.056435
N  1.301564 1.113697 1.687309
N  3.569172 1.215683 1.573136
N  2.276665 1.764333 -0.320037
C  -1.96958 -0.536005 -0.409687
C  -3.200442 -1.099172 -0.109052
C  -0.878257 -2.508296 -0.281214
C  -3.213559 -2.464832 0.135688
C  -2.035557 -3.18929 0.051814
C  -4.477691 -0.324729 -0.144244
C  0.460156 -3.184668 -0.416766
C  -0.024103 1.09597 1.335627
C  2.426802 1.379783 0.935619
C  4.668642 1.466184 0.875792
C  3.386367 2.018848 -1.007214
C  4.646645 1.886305 -0.449468
C  -6.313963 0.37986 1.131017
C  5.89609 0.854774 2.801493
C  1.993476 2.547295 -2.84554
H  -4.137061 -2.968741 0.386398
H  -2.040983 -4.25173 0.245916
H  1.484069 0.814386 2.636436
H  5.548836 2.093614 -1.005928
H  -6.205638 1.427442 0.852188
H  -7.075621 -0.088876 0.508985
H  -6.603696 0.311862 2.175085
H  6.952297 0.797947 3.05124
H  5.449512 -0.134034 2.908587
H  5.402688 1.547384 3.483281
H  1.388923 3.288761 -2.32171
H  2.164478 2.890815 -3.862206
H  1.465363 1.593535 -2.882502
H  0.504639 1.702753 -0.559282
elementType: S F O N C H
totalener: -2078.34774983 hartree
nucrepener: 3594.65222146 hartree
electener: -5672.99997129 hartree
twoeener: 4336.24683467 hartree
cpcmener: -0.04572241 hartree
kineticenergy: 2071.24349680 hartree
xcener: -168.056883830161 hartree
chargesum: 0.0000000
charge: 0.871459 -0.169567 -0.166259 -0.172172 -0.493447 -0.474966 -0.260093 -0.405127 -0.444192 -0.290367 -0.287982 -0.308666 -0.195812 -0.133172 -0.422946 -0.427271 0.074888 0.049407 0.100566 -0.101280 -0.090480 0.413424 0.514994 0.339873 0.367331 0.414426 0.420872 -0.320922 -0.124017 -0.115982 -0.126429 0.161614 0.157841 0.192421 0.145161 0.121096 0.123335 0.133100 0.131523 0.113540 0.113791 0.116776 0.138618 0.110148 0.204945
qa: 0.8715 -0.1696 -0.1663 -0.1722 -0.4934 -0.4750 -0.2601 -0.4051 -0.4442 -0.2904 -0.2880 -0.3087 -0.1958 -0.1332 -0.4229 -0.4273 0.0749 0.0494 0.1006 -0.1013 -0.0905 0.4134 0.5150 0.3399 0.3673 0.4144 0.4209 -0.3209 -0.1240 -0.1160 -0.1264 0.1616 0.1578 0.1924 0.1452 0.1211 0.1233 0.1331 0.1315 0.1135 0.1138 0.1168 0.1386 0.1101 0.2049
va: 5.7828 1.1349 1.1350 1.1353 1.9934 2.0134 2.1511 2.0975 2.0669 2.1325 2.1428 3.0760 3.0822 3.1905 2.9675 2.9780 3.9613 3.7177 3.9036 4.0336 3.9509 4.1898 4.4770 4.4343 4.2449 4.0265 3.9926 3.9290 3.8497 3.8487 3.8431 1.0004 1.0017 1.0166 1.0163 0.9947 0.9920 0.9936 0.9935 0.9958 0.9955 0.9909 0.9956 0.9966 1.0806
dispcorr: -0.024491199 hartree
energy: -2078.372241033886
dipole: 1.53070 -0.58533 0.94537 17.55404 -19.33961 -1.78557 6.56258 -5.05332 1.50926
magnitude: 2.52188 au
magnitude: 6.41010 debye
