program: Orca
programVersion: 4.2.1
elementType: S F F F O O O O O O O N N N N N C C C C C C C C C C C C C C C H H H H H H H H H H H H H H
charge: 0
multiplicity: 1
keywords: wb97x-d3
keywords: def2-TZVPP
keywords: def2/J RIJCOSX GRIDX6 NOFINALGRIDX
keywords: grid4 nofinalgrid
keywords: scfconv7
keywords: smallprint printgap noloewdin
keywords: NOSOSCF
formula: C15H14F3N5O7S
InChI: InChI=1S/C15H14F3N5O7S/c1-28-9-6-10(29-2)21-13(20-9)22-14(25)23-31(26,27)11-7(12(24)30-3)4-5-8(19-11)15(16,17)18/h4-6,22-23H,1-3H3
45 atoms
S  -1.745465 1.423682 0.078988
F  0.55206 -2.457444 -2.57488
F  1.24728 -2.57322 -0.544774
F  0.149544 -4.217164 -1.400699
O  -1.716842 2.167031 -1.162507
O  -2.636001 1.809682 1.149922
O  -5.095531 -0.563796 1.327708
O  -4.886937 0.754824 -0.472649
O  -0.554453 0.034204 2.366431
O  3.14381 2.83117 -1.845089
O  6.075668 0.773498 1.108283
N  -0.963689 -0.957272 -0.673533
N  -0.178445 1.417199 0.603736
N  1.582972 0.500381 1.808241
N  2.34383 1.684871 -0.040534
N  3.825998 0.63731 1.463253
C  -2.030255 -0.31859 -0.27042
C  -3.265811 -0.913522 -0.057399
C  -1.047857 -2.25932 -0.878548
C  -3.334703 -2.285487 -0.250889
C  -2.209292 -2.979087 -0.667525
C  -4.497231 -0.126384 0.245218
C  0.234957 -2.888626 -1.352202
C  0.225242 0.612495 1.643097
C  2.623802 0.968598 1.034361
C  3.374647 2.114426 -0.762052
C  4.845607 1.072097 0.735962
C  4.685506 1.835206 -0.415363
C  -6.329208 0.063684 1.697927
C  1.795311 3.103581 -2.218695
C  6.269832 -0.012171 2.281134
H  -4.263012 -2.816561 -0.090864
H  -2.258783 -4.047294 -0.818325
H  1.860351 -0.067993 2.598074
H  5.52448 2.184634 -0.999193
H  -6.644063 -0.42519 2.614658
H  -6.188291 1.128014 1.883476
H  -7.088535 -0.077935 0.929536
H  1.856611 3.698043 -3.126223
H  1.272918 3.681846 -1.455542
H  1.244393 2.187609 -2.436144
H  5.804142 -0.993668 2.192146
H  7.345611 -0.134233 2.376109
H  5.886131 0.488238 3.170298
H  0.5574 1.757147 -0.034495
elementType: S F O N C H
totalener: -2078.34814727 hartree
nucrepener: 3593.22340146 hartree
electener: -5671.57154873 hartree
twoeener: 4334.86787373 hartree
cpcmener: -0.04629178 hartree
kineticenergy: 2071.24399638 hartree
xcener: -168.057420724245 hartree
chargesum: -0.0000000
charge: 0.870046 -0.169683 -0.166803 -0.172097 -0.493896 -0.475399 -0.263353 -0.403308 -0.445609 -0.288349 -0.290839 -0.309570 -0.194318 -0.132119 -0.425378 -0.423630 0.075771 0.049969 0.099717 -0.101329 -0.091603 0.417399 0.516865 0.339413 0.365716 0.420988 0.415010 -0.321249 -0.122451 -0.126203 -0.116708 0.160248 0.157904 0.191769 0.145527 0.133043 0.121791 0.123186 0.138514 0.115015 0.111069 0.113705 0.131738 0.113951 0.205538
qa: 0.8700 -0.1697 -0.1668 -0.1721 -0.4939 -0.4754 -0.2634 -0.4033 -0.4456 -0.2883 -0.2908 -0.3096 -0.1943 -0.1321 -0.4254 -0.4236 0.0758 0.0500 0.0997 -0.1013 -0.0916 0.4174 0.5169 0.3394 0.3657 0.4210 0.4150 -0.3212 -0.1225 -0.1262 -0.1167 0.1602 0.1579 0.1918 0.1455 0.1330 0.1218 0.1232 0.1385 0.1150 0.1111 0.1137 0.1317 0.1140 0.2055
va: 5.7862 1.1355 1.1346 1.1357 1.9903 2.0135 2.1534 2.1005 2.0653 2.1425 2.1323 3.0706 3.0872 3.1900 2.9773 2.9690 3.9513 3.7029 3.9052 4.0349 3.9548 4.1766 4.4740 4.4345 4.2477 3.9915 4.0248 3.9274 3.8488 3.8434 3.8488 1.0025 1.0016 1.0170 1.0162 0.9935 0.9939 0.9922 0.9958 0.9916 0.9965 0.9957 0.9934 0.9954 1.0804
dispcorr: -0.024432391 hartree
energy: -2078.372579663701
dipole: 2.71351 -1.89194 0.82157 14.29490 -16.58987 -2.29498 10.25148 -9.73927 0.51221
magnitude: 2.49084 au
magnitude: 6.33120 debye
