program: Gaussian 09
title: 000069145
version: EM64L-G09RevD.01
frameworkgroup: C1[X(C13H12N2O)]
method: RPBEPBE
basis: SDD
operation: Freq
keyword: #p
keyword: freq=noraman
keyword: PBEPBE/SDD
title: #p freq=noraman PBEPBE/SDD
converged: YES YES NO NO
title: Mulliken charges:
elementType: O N N C C C C C C C C C C C C C H H H H H H H H H H H H
charge: -0.233560 -0.706797 -0.702710 0.360456 0.342942 -0.007525 -0.560393 -0.562425 -0.422477 -0.414270 0.492385 0.495821 -0.197934 -0.209643 -0.425614 -0.422454 0.259108 0.263739 0.268330 0.268511 0.223208 0.221994 0.218725 0.218987 0.308221 0.305628 0.312787 0.304957
chargesum: 0.00000
title: Mulliken charges with hydrogens summed into heavy atoms:
elementType: O N N C C C C C C C C C C C C C
charge: -0.233560 -0.092947 -0.084966 0.360456 0.342942 -0.007525 -0.301284 -0.298686 -0.154147 -0.145759 0.492385 0.495821 0.025274 0.012350 -0.206889 -0.203466
polarizability: 2.43815312e+02 -1.58108412e+00 1.64745539e+02 1.44366535e+01 3.29029534e+00 8.92775829e+01
1716.lowfreq: -7.7208 -0.0008 -0.0007 -0.0006 2.1242 6.0505 37.5708 51.1445 76.5948
frequency: 37.5469 51.0780 76.5944 130.4159 181.7642 190.8928 219.3964 234.2374 262.2882 350.6989 353.4930 363.8775 371.4822 379.2591 386.7607 393.2425 435.4282 436.9057 508.4397 525.6288 527.0863 535.6572 614.5483 645.3150 684.1604 691.6098 702.5015 749.8008 795.3335 805.4873 819.6410 881.2581 891.8358 904.0842 904.9026 909.9295 972.5816 974.7601 977.3153 982.4742 987.9983 1030.3984 1044.7844 1096.7086 1105.4367 1138.3208 1177.8352 1181.5242 1239.4603 1296.3452 1312.0491 1325.7566 1334.1810 1394.9884 1399.1524 1448.0696 1453.6847 1484.0880 1486.4476 1539.7077 1584.1985 1591.6041 1620.4739 1624.8680 1641.3667 1643.5721 3116.9989 3118.4292 3133.5953 3135.2684 3141.6261 3143.9140 3169.1046 3172.5077 3567.0938 3568.0683 3707.6781 3708.6268
redmass: 5.3034 4.4987 4.7781 6.0642 4.6561 4.9016 3.4973 3.7389 5.1869 1.4498 3.4090 1.1742 1.0602 3.6861 1.8283 1.4335 3.0105 3.2469 4.9004 4.7533 5.6855 5.6630 5.1156 6.8376 2.2976 4.7231 2.2835 2.5407 1.5016 3.7530 2.2731 1.5800 1.5047 1.8533 1.4510 2.8934 1.3451 2.0537 2.0186 5.2171 2.4692 1.5326 1.6850 1.7010 1.4153 1.6400 1.0811 1.0841 2.2549 1.5474 1.4513 2.0418 2.9247 8.4681 8.3534 3.4356 3.7234 2.8363 2.9217 9.9580 6.0786 6.4040 4.2671 3.7685 1.2577 1.3268 1.0872 1.0875 1.0910 1.0912 1.0929 1.0930 1.0961 1.0962 1.0449 1.0449 1.1040 1.1040
irintensity: 3.0493 0.3131 1.9749 1.0625 2.5808 2.7819 2.8704 7.2659 2.9592 222.6895 48.0997 228.6311 17.7671 2.3194 53.1712 56.7902 1.3027 1.9655 0.1346 8.9989 4.3526 0.3974 1.2663 13.5600 17.7977 0.7932 7.9990 93.6769 19.5406 66.2323 39.7242 10.3046 9.1099 8.3326 7.6764 16.9004 1.3834 7.5103 14.1785 3.1029 5.9953 0.7119 1.1077 2.5789 22.6492 7.1105 4.3376 0.9893 163.4462 19.3018 43.2741 21.8534 270.9719 9.4645 19.4707 17.2484 88.5762 34.5698 14.1835 237.4536 22.1527 6.5988 56.6685 39.0574 263.3151 207.6802 12.7648 15.0353 15.0084 10.0326 26.0246 25.6525 8.4137 10.4369 79.7887 56.6939 21.0669 19.9441
temp: 298.150 k
press: 1.00000 atm
elementType: 8 7 7 6 6 6 6 6 6 6 6 6 6 6 6 6 1 1 1 1 1 1 1 1 1 1 1 1
symmnumber: 1
zpe: 578547.8 jmol-1
zpe.correction: 0.220357 hartree
zpe.thermalcorrener: 0.234485 hartree
zpe.thermalcorrenthalpy: 0.235429 hartree
zpe.thermalcorrgfe: 0.179417 hartree
zpe.sumelectzpe: -686.205319 hartree
zpe.sumelectthermal: -686.191191 hartree
zpe.sumelectthermalent: -686.190247 hartree
zpe.sumelectthermalfe: -686.246259 hartree
dipole: -0.8941 4.7112 -1.0780
dipole: 4.9150
quadrupole: -56.3278 -90.0687 -95.1524
quadrupole: 5.9173 4.2799 -1.5061
quadrupole: 24.1885 -9.5524 -14.6361 5.9173 4.2799 -1.5061
hfenergy: -686.4256762 hartree
pointgroup: C01 [X(C13H12N2O1)]
dipole: 0.506994 -1.7416156 0.6700581 debye
polarizability: 240.6809725|-9.1779334|135.8691522|-23.4464138|-36.2934068|121.2883083 unknown
InChI: InChI=1S/C13H12N2O/c14-11-5-1-3-9(7-11)13(16)10-4-2-6-12(15)8-10/h1-8H,14-15H2
charge 0 multiplicity 1
28 atoms
O  -0.009309 1.812235 -1.71857
N  -3.160839 -2.657185 0.862794
N  4.699833 -0.175914 -1.540257
C  -1.418119 0.429313 -0.34589
C  1.192006 0.272229 -0.313598
C  -0.075477 0.890675 -0.842997
C  -1.642533 -0.906468 0.069769
C  2.333157 0.308532 -1.149193
C  -2.495419 1.355717 -0.371113
C  1.291676 -0.258371 1.002531
C  -2.939395 -1.334489 0.4716
C  3.581995 -0.201489 -0.705497
C  -3.775315 0.938525 0.045397
C  2.53683 -0.751798 1.451778
C  -4.005462 -0.388748 0.465466
C  3.669871 -0.738386 0.614555
H  -0.818056 -1.628384 0.050797
H  2.230464 0.756038 -2.144836
H  -2.30793 2.374569 -0.721586
H  0.426003 -0.246223 1.670445
H  -4.608568 1.650313 0.041923
H  2.628959 -1.146372 2.470173
H  -5.009422 -0.700224 0.780135
H  4.627452 -1.131752 0.978342
H  -2.404217 -3.334498 0.86098
H  -4.088165 -2.972311 1.130632
H  4.641815 0.22452 -2.471845
H  5.600067 -0.518253 -1.218537
